{"text_format":"1","workbook":"xlsx","n_sheets":5,"sheets":["Tech Infeasible Form","Tech Infeasible Form Addtl Data","Validation","Data","Instructions"],"not_rendered":{"charts":0,"images":98,"macros":1,"external_links":0,"defined_names":168,"comments":0,"pivot_tables":0},"unopened":[],"bounds":{"document_bytes":16777216,"sheet_cells":100000,"rows_first":2000,"rows_last":500,"rows_between":2000,"halvings":0,"cell_chars":16384,"cell_head_chars":4096},"cells_cut":0,"cells_raw":0,"read":"whole","date_system":"1900"}

{"sheet":"Tech Infeasible Form","index":0,"n_rows":74,"n_cols":12,"rows_kept":74,"cut":false,"hidden":false,"merged":[[32,4,32,5],[37,1,37,3],[0,3,0,8],[19,6,19,7],[20,6,20,7],[26,4,26,5],[21,6,21,7],[21,4,21,5],[18,4,18,5],[23,4,23,5],[25,4,25,5],[19,4,19,5],[20,4,20,5],[72,0,72,8],[41,0,41,2],[42,0,42,2],[42,3,42,8],[43,0,43,8],[41,3,41,8],[44,0,46,8],[71,1,71,8],[67,1,67,3],[67,6,67,8],[69,6,69,8],[40,0,40,2],[39,0,39,2],[34,4,34,5],[33,4,33,5],[20,1,20,3],[29,1,29,3],[28,4,28,5],[31,4,31,5],[37,4,37,5],[35,4,35,5],[36,4,36,5],[24,4,24,5],[29,4,29,5],[27,4,27,5],[40,3,40,8],[39,3,39,8],[30,4,30,5],[19,1,19,3],[10,6,10,7],[11,6,11,7],[10,4,10,5],[11,4,11,5],[15,4,15,8],[12,6,12,7],[17,6,17,7],[16,4,16,5],[16,6,16,7],[1,0,1,8],[18,6,18,7],[4,6,4,8],[5,6,5,8],[6,6,6,8],[7,6,7,8],[8,6,8,8],[12,4,12,5],[17,1,17,3],[18,1,18,3],[2,0,2,3],[13,6,13,7],[7,1,7,3],[14,4,14,5],[13,4,13,5],[17,4,17,5]]}
["(03-20)",null,null,"Forward Completed Forms to District ADA Coordinators"]
["ADA Technically Infeasible Form\n(Used to document design decisions and to be completed before construction)"]
["*Facility Type",null,null,null,"Complete Section Below to ADD Location to Transition Plan"]
[null,null,null,null,"*Add Location to Transition Plan"]
[null,null,null,null,"Suggested Repair"]
[null,null,null,null,"Approx. Repair Costs"]
[null,null,null,null,"Actual Repair Costs"]
[null,null,null,null,"Actual Repair"]
[null,null,null,null,"Date Repaired"]
["Justification for Technically Infeasible",null,null,null,"General Information"]
["(check all that apply)",null,null,null,"*District:"]
[null,null,null,null,"*County:",null,null,null,null,null,null,"Keep this information below"]
[null,null,null,null,"*Township/Boro:",null,null,null,null,null,null,{"$f":"IF(G12=\"\",\"\",VLOOKUP(G12,Validation!E2:F69,2))","v":""}]
[null,null,null,null,"Project ECMS #"]
[]
[null,null,null,null,"Submitter Information"]
[null,null,null,null,"Submitted By:"]
[null,null,null,null,"Submitter Company:"]
[null,null,null,null,"Street Address"]
[null,null,null,null,"City State Zip"]
[null,null,null,null,"Telephone",null,null,null,null," "]
[null,null,null,null,"*Date Submitted:"]
["Project Information",null,null,null,"Location Identification"]
["Project Type",null,null,null,null,null,null,null,"    Northbound"]
[]
[null,null,null,null,"*SR North - Segment, Offset"]
[]
[]
[null,null,null,null,"*SR South - Segment, Offset"]
[]
["Pedestrian Traffic"]
["Pedestrian Trip Generators",null,null,null,"*SR East - Segment, Offset"]
["Safety Concerns"]
["R9-3A \"No Peds\" Signs"]
["Existing Crosswalk",null,null,null,"*SR West - Segment,Offset"]
["Existing Sidewalk"]
["Existing Push Buttons"]
["ADT",null,null,null,"Location #"]
[]
["Investigated design alternatives",null,null,"Why alternative was not selected"]
["1.) "]
["2.) "]
["3.) "]
["Alternative selected and description of what requirement is not met"]
[]
[]
[]
[]
[]
[]
[]
[]
[]
[]
[]
[]
[]
[]
[]
[]
{"$rows_left_out":15}
{"sheet":"Tech Infeasible Form Addtl Data","index":1,"n_rows":54,"n_cols":2,"rows_kept":54,"cut":false,"hidden":false,"merged":[[5,0,5,8],[6,0,14,8],[2,0,2,8],[51,1,51,8],[52,0,52,8],[16,0,16,8],[28,0,28,8],[17,0,26,8],[29,0,37,8],[39,0,39,8],[40,0,48,8]]}
[{"$f":"'Tech Infeasible Form'!A1","v":"(03-20)"}]
[]
["ADA Technically Infeasible Form"]
["(Additional Explanation Sheet)"]
[]
["Investigated Design Alternative #1"]
[]
[]
[]
[]
[]
[]
[]
[]
[]
[]
["Investigated Design Alternative #2"]
[]
[]
[]
[]
[]
[]
[]
[]
[]
[]
[]
["Investigated Design Alternative #3"]
[]
[]
[]
[]
[]
[]
[]
[]
[]
[]
["Summary"]
[]
[]
[]
[]
[]
[]
[]
[]
[]
[]
[]
["TIF #:",{"$f":"IF('Tech Infeasible Form'!B72:I72=\"\",\"\",'Tech Infeasible Form'!B72:I72)","v":""}]
["(TIF Number automatically assigned. All fields marked with * provide data for TIF #)"]
["Sheet 2 - Technically Infeasible Form"]

{"sheet":"Validation","index":2,"n_rows":2575,"n_cols":25,"rows_kept":2575,"cut":false,"hidden":true,"merged":[]}
["C:\\","(Month)","(Day)","Engineering District Code","County","County Code","Municipality Name","Municipality Code","Construction Phase","Ramp Crosses","Ramp Surface","yes or no","DWS Type","Road Desc","CrossWalks","Ramp Type","MUNICIPAL_NAME","FIPS_MUN_CODE","FIPS_COUNTY_CODE","Blank","Status","Ramp Location #","County",null,"photos"]
["(Year)","(Month)","(Day)","(Select)","(Select)","(Select)","(Select)","(Select)","(Select)","(Select)","(Select)","(Select)","(Select)","(Select)","(Select)","(Select)",null,null,null,"(Select)","Current","(Select)","(Select)",null,1]
["2006","01","01","01","Adams","001","Abbottstown Boro",116,"Constructed","State Route","Brick","No","Mat","SR","Single Ramp with Single Cross Walk","Type 1","Abbottstown Boro",116,1,null,"Archive","01","Crawford",1,2]
["2007","02","02","02","Allegheny","003","Arendtsville Boro",2928,"Ex - Surveyed","Local Road","Concrete","Yes","Paver",null,"Single Ramp with Double Cross Walk","Type 1A","Arendtsville Boro",2928,1,null,null,"02","Erie",1,3]
["2008","03","03","03","Armstrong","005","Benderville Boro",5536,"Missing","Both","Other",null,"Steel","Ave",null,"Type 2","Benderville Boro",5536,1,null,null,"03","Forest",1,4]
["2009","04","04","04","Beaver","007","Berwick Twp",5880,null,null,null,null,"Tile","Blvd",null,"Type 3","Berwick Twp",5880,1,null,null,"04","Mercer",1,5]
["2010","05","05","05","Bedford","009","Biglerville Boro",6296,null,null,null,null,"Other","Dr",null,"Type 4","Biglerville Boro",6296,1,null,null,"05","Venango",1,6]
["2011","06","06","06","Berks","011","Bonneauville Boro",7560," ",null,null,null,null,"Expwy",null,"Type 4A","Bonneauville Boro",7560,1,null,null,"06","Warren",1,7]
["2012","07","07","08","Blair","013","Butler Twp",10456,null,null,null,null,null,"Frwy",null,"Type 5","Butler Twp",10456,1,null,null,"07","Cameron",2,8]
["2013","08","08","09","Bradford","015","Carroll Valley Boro",11472,null,null,null,null,null,"Hwy",null,"Type 6","Carroll Valley Boro",11472,1,null,null,"08","Centre",2,9]
["2014","09","09","10","Bucks","017","Conewago Twp",15632,null,null,null,null,null,"Ln",null,"Median Type A","Conewago Twp",15632,1,null,null,"09","Clearfield",2,10]
["2015","10","10","11","Butler","019","Cumberland Twp",17640,null,null,null,null,null,"Pkwy",null,"Median Type B","Cumberland Twp",17640,1,null,null,"10","Clinton",2,11]
["2016","11","11","12","Cambria","021","East Berlin Boro",20792,null,null,null,null,null,"Rd",null,"Blended Transition","East Berlin Boro",20792,1,null,null,"11","Elk",2,12]
["2017","12","12",null,"Cameron","023","Fairfield Boro",24560,null,null,null,null,null,"St",null,null,"Fairfield Boro",24560,1,null,null,"12","Juniata",2,13]
["2018",null,"13",null,"Carbon","025","Franklin Twp",27320,null,null,null,null,null,null,null,null,"Franklin Twp",27320,1,null,null,"13","McKean",2,14]
["2019",null,"14",null,"Centre","027","Freedom Twp",27704,null,null,null,null,null,null,null,null,"Freedom Twp",27704,1,null,null,"14","Mifflin",2,15]
["2020",null,"15",null,"Chester","029","Germany Twp",28936,null,null,null,null,null,null,null,null,"Germany Twp",28936,1,null,null,"15","Potter",2,16]
["2021",null,"16",null,"Clarion","031","Gettysburg Boro",28960,null,null,null,null,null,null,null,null,"Gettysburg Boro",28960,1,null,null,"16","Bradford",3,17]
["2022",null,"17",null,"Clearfield","033","Hamilton Twp",32144,null,null,null,null,null,null,null,null,"Hamilton Twp",32144,1,null,null,"17","Columbia",3,18]
["2023",null,"18",null,"Clinton","035","Hamiltonban Twp",32200,null,null,null,null,null,null,null,null,"Hamiltonban Twp",32200,1,null,null,"18","Lycoming",3,19]
["2024",null,"19",null,"Columbia","037","Highland Twp",34424,null,null,null,null,null,null,null,null,"Highland Twp",34424,1,null,null,"19","Montour",3,20]
["2025",null,"20",null,"Crawford","039","Huntington Twp",36424,null,null,null,null,null,null,null,null,"Huntington Twp",36424,1,null,null,"20","Northumberland",3,21]
["2026",null,"21",null,"Cumberland","041","Latimore Twp",41672,null,null,null,null,null,null,null,null,"Latimore Twp",41672,1,null,null,"21","Snyder",3,22]
["2027",null,"22",null,"Dauphin","043","Liberty Twp",43056,null,null,null,null,null,null,null,null,"Liberty Twp",43056,1,null,null,"22","Sullivan",3,23]
["2028",null,"23",null,"Delaware","045","Littlestown Boro",43944,null,null,null,null,null,null,null,null,"Littlestown Boro",43944,1,null,null,"23","Tioga",3,24]
["2029",null,"24",null,"Elk","047","McSherrystown Boro",46376,null,null,null,null,null,null,null,null,"McSherrystown Boro",46376,1,null,null,"24","Union",3,25]
["2030",null,"25",null,"Erie","049","Menallen Twp",48608,null,null,null,null,null,null,null,null,"Menallen Twp",48608,1,null,null,"25","Lackawanna",4,26]
["2031",null,"26",null,"Fayette","051","Mount Joy Twp",51640,null,null,null,null,null,null,null,null,"Mount Joy Twp",51640,1,null,null,"26","Luzerne",4,27]
["2032",null,"27",null,"Forest","053","Mount Pleasant Twp",51776,null,null,null,null,null,null,null,null,"Mount Pleasant Twp",51776,1,null,null,"27","Pike",4,28]
["2033",null,"28",null,"Franklin","055","New Oxford Boro",53920,null,null,null,null,null,null,null,null,"New Oxford Boro",53920,1,null,null,"28","Susquehanna",4,29]
["2034",null,"29",null,"Fulton","057","Oxford Twp",57472,null,null,null,null,null,null,null,null,"Oxford Twp",57472,1,null,null,"29","Wayne",4,30]
["2035",null,"30",null,"Greene","059","Reading Twp",63616,null,null,null,null,null,null,null,null,"Reading Twp",63616,1,null,null,"30","Wyoming",4,31]
["2036",null,"31",null,"Huntingdon","061","Straban Twp",74680,null,null,null,null,null,null,null,null,"Straban Twp",74680,1,null,null,"31","Berks",5,32]
["2037",null,null,null,"Indiana","063","Tyrone Twp",78160,null,null,null,null,null,null,null,null,"Tyrone Twp",78160,1,null,null,"32","Carbon",5,33]
["2038",null,null,null,"Jefferson","065","Union Twp",78264,null,null,null,null,null,null,null,null,"Union Twp",78264,1,null,null,"33","Lehigh",5,34]
["2039",null,null,null,"Juniata","067","York Springs Boro",87136,null,null,null,null,null,null,null,null,"York Springs Boro",87136,1,null,null,"34","Monroe",5,35]
["2040",null,null,null,"Lackawanna","069","Aleppo Twp",724,null,null,null,null,null,null,null,null,"Aleppo Twp",724,3,null,null,"35","Northampton",5,36]
["2041",null,null,null,"Lancaster","071","Aspinwall Boro",3320,null,null,null,null,null,null,null,null,"Aspinwall Boro",3320,3,null,null,"36","Schuylkill",5,37]
["2042",null,null,null,"Lawrence","073","Avalon Boro",3608,null,null,null,null,null,null,null,null,"Avalon Boro",3608,3,null,null,"37","Bucks",6,38]
["2043",null,null,null,"Lebanon","075","Baldwin Boro",3928,null,null,null,null,null,null,null,null,"Baldwin Boro",3928,3,null,null,"38","Chester",6,39]
["2044",null,null,null,"Lehigh","077","Baldwin Twp",3932,null,null,null,null,null,null,null,null,"Baldwin Twp",3932,3,null,null,"39","Delaware",6,40]
["2045",null,null,null,"Luzerne","079","Bell Acres Boro",5216,null,null,null,null,null,null,null,null,"Bell Acres Boro",5216,3,null,null,"40","Montgomery",6,41]
["2046",null,null,null,"Lycoming","081","Bellevue Boro",5312,null,null,null,null,null,null,null,null,"Bellevue Boro",5312,3,null,null,"41","Philadelphia",6,42]
["2047",null,null,null,"McKean","083","Ben Avon Boro",5504,null,null,null,null,null,null,null,null,"Ben Avon Boro",5504,3,null,null,"42","Adams",8,43]
["2048",null,null,null,"Mercer","085","Ben Avon Heights Boro",5520,null,null,null,null,null,null,null,null,"Ben Avon Heights Boro",5520,3,null,null,"43","Cumberland",8,44]
["2049",null,null,null,"Mifflin","087","Bethel Park Boro",6064,null,null,null,null,null,null,null,null,"Bethel Park Boro",6064,3,null,null,"44","Dauphin",8,45]
["2050",null,null,null,"Monroe","089","Blawnox Boro",7000,null,null,null,null,null,null,null,null,"Blawnox Boro",7000,3,null,null,"45","Franklin",8,46]
["2051",null,null,null,"Montgomery","091","Brackenridge Boro",7976,null,null,null,null,null,null,null,null,"Brackenridge Boro",7976,3,null,null,"46","Lancaster",8,47]
["2052",null,null,null,"Montour","093","Braddock Boro",7992,null,null,null,null,null,null,null,null,"Braddock Boro",7992,3,null,null,"47","Lebanon",8,48]
["2053",null,null,null,"Northampton","095","Braddock Hills Boro",8008,null,null,null,null,null,null,null,null,"Braddock Hills Boro",8008,3,null,null,"48","Perry",8,49]
["2054",null,null,null,"Northumberland","097","Bradfordwoods Boro",8064,null,null,null,null,null,null,null,null,"Bradfordwoods Boro",8064,3,null,null,null,"York",8,50]
["2055",null,null,null,"Perry","099","Brentwood Boro",8416,null,null,null,null,null,null,null,null,"Brentwood Boro",8416,3,null,null,null,"Bedford",9,51]
["2056",null,null,null,"Philadelphia","101","Bridgeville Boro",8624,null,null,null,null,null,null,null,null,"Bridgeville Boro",8624,3,null,null,null,"Blair",9,52]
["2057",null,null,null,"Pike","103","Carnegie Boro",11336,null,null,null,null,null,null,null,null,"Carnegie Boro",11336,3,null,null,null,"Cambria",9,53]
["2058",null,null,null,"Potter","105","Castle Shannon Boro",11680,null,null,null,null,null,null,null,null,"Castle Shannon Boro",11680,3,null,null,null,"Fulton",9,54]
["2059",null,null,null,"Schuylkill","107","Chalfant Boro",12496,null,null,null,null,null,null,null,null,"Chalfant Boro",12496,3,null,null,null,"Huntingdon",9,55]
["2060",null,null,null,"Snyder","109","Cheswick Boro",13392,null,null,null,null,null,null,null,null,"Cheswick Boro",13392,3,null,null,null,"Somerset",9,56]
["2061",null,null,null,"Somerset","111","Churchill Boro",13608,null,null,null,null,null,null,null,null,"Churchill Boro",13608,3,null,null,null,"Armstrong",10,57]
["2062",null,null,null,"Sullivan","113","Clairton City",13704,null,null,null,null,null,null,null,null,"Clairton City",13704,3,null,null,null,"Butler",10,58]
["2063",null,null,null,"Susquehanna","115","Collier Twp",15216,null,null,null,null,null,null,null,null,"Collier Twp",15216,3,null,null,null,"Clarion",10,59]
{"$rows_left_out":2516}
{"sheet":"Data","index":3,"n_rows":2,"n_cols":55,"rows_kept":2,"cut":false,"hidden":true,"merged":[]}
["TIF_NUM","DISTRICT","COUNTY","MUNIC","ECMS","FAC_TYP","OTHER_DES","LIM_RW","EX_UTIL","STRUCT","HISTORIC","ENVIRON","GRADE_SEP","OTHER1","OTHER2","OTHER3","OTHER4","RESURF_PROJ","SIG_PROJ","WIDE_PROJ","RECON_PROJ","NEW_PROJ","OTHER_PROJ","OTHER_PROJ_DES","PED_TRAF","TRIP_GEN","SAFETY","R9-3A","EX_XWALK","EX_SW","EX_PB","ADT","SUBMIT_BY","SUBMIT_CO","DATE_SUB","SR_NORTH","SR_SOUTH","SR_EAST","SR_WEST","LOC_ID","INV1","INV2","INV3","DROP1","DROP2","DROP3","SEL_ALT","ARC_APPROV","ADE_APPROV","TP_ITEM","SUG_REPAIR","APPROX_COST","ACT_COSTS","ACT_REPAIRED","DATE_REPAIRED"]
[{"$f":"IF('Tech Infeasible Form'!B72=\"\",\"\",'Tech Infeasible Form'!B72)","v":""},{"$f":"IF('Tech Infeasible Form'!G11=\"\",\"\",'Tech Infeasible Form'!G11)","v":""},{"$f":"IF('Tech Infeasible Form'!G12=\"\",\"\",'Tech Infeasible Form'!G12)","v":""},{"$f":"IF('Tech Infeasible Form'!G13=\"\",\"\",'Tech Infeasible Form'!G13)","v":""},{"$f":"IF('Tech Infeasible Form'!G14=\"\",\"\",'Tech Infeasible Form'!G14)","v":""},"Curb Ramp",{"$f":"IF('Tech Infeasible Form'!B8=\"\",\"\",'Tech Infeasible Form'!B8)","v":""},false,false,false,false,null,null,{"$f":"IF('Tech Infeasible Form'!B18=\"\",\"\",'Tech Infeasible Form'!B18)","v":""},{"$f":"IF('Tech Infeasible Form'!B19=\"\",\"\",'Tech Infeasible Form'!B19)","v":""},{"$f":"IF('Tech Infeasible Form'!B20=\"\",\"\",'Tech Infeasible Form'!B20)","v":""},{"$f":"IF('Tech Infeasible Form'!B21=\"\",\"\",'Tech Infeasible Form'!B21)","v":""},false,null,null,null,null,null,{"$f":"IF('Tech Infeasible Form'!B30=\"\",\"\",'Tech Infeasible Form'!B30)","v":""},"Yes","Yes","No","No","Yes","Yes","Yes",{"$f":"IF('Tech Infeasible Form'!B38=\"\",\"\",'Tech Infeasible Form'!B38)","v":""},{"$f":"IF('Tech Infeasible Form'!G17=\"\",\"\",'Tech Infeasible Form'!G17)","v":""},{"$f":"IF('Tech Infeasible Form'!G18=\"\",\"\",'Tech Infeasible Form'!G18)","v":""},{"$f":"IF('Tech Infeasible Form'!G22=\"\",\"\",TEXT('Tech Infeasible Form'!G22,\"mmmm d, yyyy\"))","v":""},{"$f":"IF('Tech Infeasible Form'!E25=\"\",\"\",'Tech Infeasible Form'!E25)","v":""},{"$f":"IF('Tech Infeasible Form'!E28=\"\",\"\",'Tech Infeasible Form'!E28)","v":""},{"$f":"IF('Tech Infeasible Form'!E31=\"\",\"\",'Tech Infeasible Form'!E31)","v":""},{"$f":"IF('Tech Infeasible Form'!E34=\"\",\"\",'Tech Infeasible Form'!E34)","v":""},{"$f":"IF('Tech Infeasible Form'!E37=\"\",\"\",TEXT('Tech Infeasible Form'!E37,\"00\"))","v":""},{"$f":"IF('Tech Infeasible Form'!A41=\"1.) \",\"\",'Tech Infeasible Form'!A41)","v":""},{"$f":"IF('Tech Infeasible Form'!A42=\"2.) \",\"\",'Tech Infeasible Form'!A42)","v":""},{"$f":"IF('Tech Infeasible Form'!A43=\"3.) \",\"\",'Tech Infeasible Form'!A43)","v":""},{"$f":"IF('Tech Infeasible Form'!D41=\"\",\"\",'Tech Infeasible Form'!D41)","v":""},{"$f":"IF('Tech Infeasible Form'!D42=\"\",\"\",'Tech Infeasible Form'!D42)","v":""},{"$f":"IF('Tech Infeasible Form'!D43=\"\",\"\",'Tech Infeasible Form'!D43)","v":""},{"$f":"IF('Tech Infeasible Form'!A45=\"\",\"\",'Tech Infeasible Form'!A45)","v":""},"Approved","Approved","No",{"$f":"IF('Tech Infeasible Form'!G5=\"\",\"\",'Tech Infeasible Form'!G5)","v":""},{"$f":"IF('Tech Infeasible Form'!G6=\"\",\"\",'Tech Infeasible Form'!G6)","v":""},{"$f":"IF('Tech Infeasible Form'!G7=\"\",\"\",'Tech Infeasible Form'!G7)","v":""},{"$f":"IF('Tech Infeasible Form'!G8=\"\",\"\",'Tech Infeasible Form'!G8)","v":""},{"$f":"IF('Tech Infeasible Form'!G9=\"\",\"\",TEXT('Tech Infeasible Form'!G9,\"mmmm d, yyyy\"))","v":""}]

{"sheet":"Instructions","index":4,"n_rows":129,"n_cols":11,"rows_kept":129,"cut":false,"hidden":false,"merged":[[0,0,0,1],[65,0,65,1],[67,0,127,8],[2,0,60,8]]}
["(6-12)",null,null,null,null,null,null,null,"TIF Instructions"]
[]
["ADA Technically Infeasible Form (TIF) Instructions\n \nThe Technically Infeasible Form will be used for existing sites where it is technically infeasible to construct pedestrian facilities\nto fully meet current PennDOT standards, as determined by using sound engineering judgment.  This must be submitted\nand approved before construction to document that access has been designed to the maximum extent feasible. \n \nProject scope, not cost, will determine when existing site constraints justify the use of the Technically Infeasible Form. In certain situations, existing site constraints may justify the use of a design that provides access to the maximum extent feasible if removing the existing site constraints would require additional work that is not included as part of the project scope.  See DM-2 Chapter 6.\n\nGeneral Setup\nBefore you Begin: The electronic file is delivered in Excel Template *.xlt format. When saving the file, use Excel 2003 format with a *.xls extension. Do not use a different file format.  \n\nSet the macro security to low or medium. (Tools – Options – Security Tab – Macro Security – Low or Medium)\n \nFacility Type\nIndicate which facility type is being investigated.  If “Other” is selected, please provide a description of the facility.\n \nJustification for Technically Infeasible\nIndicate which justifications for technically infeasible apply for the investigated facility (there can be more than one option checked).  If “Other” is selected, please provide a description of the justification.  Items checked must not be included in the scope of the project.  NOTE:  If using the Technically Infeasible form to document a grievance use “Other 1” and put “Grievance” \n \nProject Information\nIndicate project type.  If “Other” is selected, please provide a description of the project being performed. Also, be sure to complete the remaining questions by answering “Yes” or “No” to the appropriate questions then provide the Average Daily Traffic(ADT) for the roadway the pedestrian facility crosses on the line provided.\nPedestrian Traffic, Pedestrian Trip Generators, Safety Concerns, R9-3A Signs\nExisting Crosswalk, Existing Sidewalk, Existing Push Buttons.\nAverage Daily Traffic(ADT)\n \nTransition Plan Location\nThe Transition Plan is a list of pedestrian facilities to be repaired at a later date.  Complete this section if the identified facility is going to be placed on the Transition Plan.  Marking “YES” in the “Add Location to Transition Plan will automatically assign a Transition Plan number to the form.\n\nGeneral Information\nSelect the appropriate PennDOT Engineering District number, County, Township/Borough, and ECMS number.\n \nSubmitter Information\nComplete the submitter information section by indicating who is submitting the TIF, the submitter’s company, their street address and city, state, and zip of their location, the company’s telephone number and the date the TIF was submitted. \n\nLocation Identification\nUsing the intersection figure, click the appropriate button for the investigated facility (The location # will automatically be assigned when the appropriate button is selected).  Then, provide the State Route (SR) number, segment and offset for the appropriate segment of roadway the facility crosses.  NOTE:  Segment and offsets shall identify the center of the intersection.  \n \nInvestigated Design Alternatives/Why Alternative Was Not Selected\nProvide a description for the investigated design alternatives and why each alternative was not selected to justify why Technically Infeasible is being applied to the particular pedestrian facility.\n\nAlternative Selected and Description of What Requirement is Not Met\nProvide a description of the alternative that was selected and what requirement(s) per PennDOT standards that the project does not meet."]
[]
[]
[]
[]
[]
[]
[]
[]
[]
[]
[]
[]
[]
[null,null,null,null,null,null,null,null,null,null," "]
[]
[]
[]
[]
[]
[]
[]
[]
[]
[]
[]
[]
[]
[]
[]
[]
[]
[]
[]
[]
[]
[]
[]
[]
[]
[]
[]
[]
[]
[]
[]
[]
[]
[]
[]
[]
[]
[]
[]
[]
[]
[]
[]
{"$rows_left_out":69}