{"text_format":"1","workbook":"xlsx","n_sheets":21,"sheets":["Setup","Specs","Agg Blends",".45 Power","Gmm","Trial Blends","VCA","Design Agg","Gmm2","AC Trials","AC Charts","Nmax","Drain Down","T-283","Height Data","TR 448A","Sheet1","Rap","Blend 1","Blend 2","Blend 3"],"not_rendered":{"charts":9,"images":1,"macros":1,"external_links":3,"defined_names":38,"comments":2,"pivot_tables":0},"unopened":[],"bounds":{"document_bytes":16777216,"sheet_cells":100000,"rows_first":2000,"rows_last":500,"rows_between":2000,"halvings":0,"cell_chars":16384,"cell_head_chars":4096},"cells_cut":0,"cells_raw":0,"read":"whole","date_system":"1900"}

{"sheet":"Setup","index":0,"n_rows":43,"n_cols":16,"rows_kept":43,"cut":false,"hidden":false,"merged":[[7,2,7,3],[7,4,7,6],[2,0,3,8],[5,2,5,3],[5,4,5,6],[6,2,6,3],[6,4,6,6],[8,2,8,3],[8,4,8,6],[10,2,10,3],[10,4,10,6],[12,2,12,3],[12,4,12,6],[9,2,9,3],[9,4,9,6],[11,2,11,3],[11,4,11,6],[13,2,13,3],[13,4,13,6],[14,2,14,3],[14,4,14,6],[15,2,15,3],[15,4,15,6],[20,2,20,6],[16,2,16,3],[16,4,16,6],[19,2,19,4],[19,5,19,6],[18,5,18,6],[18,2,18,4],[22,2,22,4],[22,5,22,6],[23,2,23,4],[23,5,23,6],[24,2,24,6]]}
[null,null,null,null,null,null,null,null,null,null,null,null,4.75,"SP.75"]
["ESB-19",null,null,null,null,null,null,null,null,null,null,null,6.33,"SR4.75"]
["PA DESIGN SOFTWARE FOR HMA AND SMA",null,null,null,null,null,null,null,null,null,null,null,9.5,"SP6.33"]
[null,null,null,null,null,null,null,null,null,null,null,null,12.5,"SP9.5"]
[null,null,null,null,null,null,null,null,null,null,null,null,19,"SR9.5"]
[null,null,"Date",null,null,null,null,null,null,null,null,null,25,"SP12.5"]
[null,null,"Producer",null,null,null,null,null,null,null,null,null,37.5,"SR12.5"]
[null,null,"Designed by",null,null,null,null,null,null,null,null,null,"<.3","SP19W"]
[null,null,"Nominal Size of Mix",null,null,null,null,null,null,null,null,null,".3 to <3","SP19B"]
[null,null,"Material Class",null,null,null,null,null,null,null,null,null,"3 to <10","SR19W"]
[null,null,"SRL",null,null,null,null,null,null,null,null,null,"10 to <30","SR19B"]
[null,null,"Esals",null,null,null,null,null,null,null,null,null,"3 to <30","SP25B"]
[null,null,"Asphalt Supplier",null,null,null,null,null,null,null,null,null,">30","SP25BC"]
[null,null,"Grade of Asphalt",null,null,null,null,null,null,null,null,null,null,"SR25B"]
[null,null,"Gb of Asphalt",null,null,null,null,null,null,null,null,null,null,"SR25BC"]
[null,null,"Gyrations @ Ndesign",null,null,null,null,null,null,null,null,null,null,"SP37.5"]
[null,null,"Percent Rap",null,null,null,null,null,null,null,null,null,null,"SR37.5",null,"Volumeter"]
[null,null,null,null,null,null,null,null,null,null,null,null,null,"SMA95",null,"Suspension"]
[null,null,"Method of Testing Max Gravity",null,null,"Suspension",null,null,null,null,null,null,null,"SMA125"]
[null,null,"Calibration of Volumeter",null,null,null,null,null,null,null,null,null,null,"ATPBC"]
[null,null,"(Weight of volumeter + H2O or Weight of volumeter in H2O)",null,null,null,null,null,null,null,null,null,null,"WM6.33"]
[null,null,null,null,null,null,null,null,null,null,null,null,null,"WM9.5"]
[null,null,"Method of Testing Plug Gravity",null,null,"Suspension",null,null,null,null,null,null,null,"WR9.5"]
[null,null,"Calibration of Volumeter",null,null,null,null,null,null,null,null,null,null,"WM12.5"]
[null,null,"(Weight of volumeter + H2O or Weight of volumeter in H2O)",null,null,null,null,null,null,null,null,null,null,"WR12.5"]
[null,null,null,null,null,null,null,null,null,null,null,null,null,"WM19W"]
[null,null,null,null,null,null,null,null,null,null,null,null,null,"WM19B"]
[null,null,null,null,null,null,null,null,null,null,null,null,null,"WR19W"]
[null,null,null,null,null,null,null,null,null,null,null,null,null,"WR19B"]
[null,null,null,null,null,null,null,null,null,null,null,null,null,"WM25B"]
[null,null,null,null,null,null,null,null,null,null,null,null,null,"WM25BC"]
[null,null,null,null,null,null,null,null,null,null,null,null,null,"WR25B"]
[null,null,null,null,null,null,null,null,null,null,null,null,null,"WR25BC"]
[null,null,null,null,null,null,null,null,null,null,null,null,null,"WM37.5"]
[null,null,null,null,null,null,null,null,null,null,null,null,null,"WR37.5"]
[null,null,null,null,null,null,null,null,null,null,null,null,null,"SP19W / SP19B"]
[null,null,null,null,null,null,null,null,null,null,null,null,null,"SR19W / SR19B"]
[null,null,null,null,null,null,null,null,null,null,null,null,null,"SP25B / SP25BC"]
[null,null,null,null,null,null,null,null,null,null,null,null,null,"SR25B / SR25BC"]
[null,null,null,null,null,null,null,null,null,null,null,null,null,"WM19W / WM19B"]
[null,null,null,null,null,null,null,null,null,null,null,null,null,"WR19W / WR19B"]
[null,null,null,null,null,null,null,null,null,null,null,null,null,"WM25B / WM25BC"]
[null,null,null,null,null,null,null,null,null,null,null,null,null,"WR25B / WR25BC"]

{"sheet":"Specs","index":1,"n_rows":57,"n_cols":81,"rows_kept":57,"cut":false,"hidden":true,"merged":[[5,75,6,76],[5,77,7,77],[5,78,7,78],[6,23,6,33],[6,34,6,44],[7,23,7,33],[7,34,7,35],[0,23,0,24],[2,23,3,44],[5,23,5,44],[5,66,6,66],[5,71,7,72],[5,73,6,74],[11,23,11,33],[11,71,11,72],[12,23,12,33],[12,71,12,72],[13,23,13,33],[14,23,14,33],[14,34,14,44],[8,23,8,33],[8,71,8,72],[9,23,9,33],[9,71,9,72],[10,23,10,33],[10,71,10,72],[15,23,15,33],[15,34,15,44],[15,65,17,65],[15,66,15,68],[15,69,15,74],[15,75,15,80],[16,34,16,44],[16,66,17,66],[16,67,17,67],[16,68,17,68],[16,69,16,74],[16,75,16,80],[17,28,17,39],[18,28,18,39],[18,67,22,67],[18,68,22,68],[19,28,19,33],[19,34,19,36],[19,37,19,39],[20,28,20,33],[23,65,23,67],[23,69,23,74],[20,34,20,36],[20,37,20,39],[20,66,22,66],[21,28,21,33],[21,34,21,36],[21,37,21,39],[22,28,22,33],[22,34,22,36],[22,37,22,39],[25,28,25,33],[25,34,25,36],[25,37,25,39],[26,28,26,33],[26,34,26,36],[26,37,26,39],[23,28,23,33],[23,34,23,36],[23,37,23,39],[24,28,24,33],[24,34,24,36],[24,37,24,39],[28,28,28,33],[28,34,28,36],[28,37,28,39],[29,28,29,33],[29,34,29,36],[29,37,29,39],[26,67,26,78],[27,28,27,33],[27,34,27,36],[27,37,27,39],[27,67,27,68],[27,69,27,70],[27,71,27,72],[27,73,27,74],[27,75,27,76],[27,77,27,78],[35,28,35,32],[35,33,35,39],[36,28,36,32],[36,33,36,39],[37,28,37,32],[37,33,37,39],[31,28,31,39],[32,28,32,32],[32,33,32,39],[33,28,33,32],[33,33,33,39],[34,28,34,32],[34,33,34,39],[43,28,43,32],[43,33,43,39],[44,28,44,32],[44,33,44,39],[45,28,45,32],[45,33,45,39],[38,28,38,32],[38,33,38,39],[39,28,39,32],[39,33,39,39],[41,28,41,39],[42,28,42,32],[42,33,42,39],[49,28,49,32],[49,33,49,39],[50,28,50,32],[50,33,50,39],[51,28,51,32],[51,33,51,39],[46,28,46,32],[46,33,46,39],[47,28,47,32],[47,33,47,39],[48,28,48,32],[48,33,48,39],[55,28,55,32],[55,33,55,39],[56,28,56,32],[56,33,56,39],[52,28,52,32],[52,33,52,39],[53,28,53,32],[53,33,53,39],[54,28,54,32],[54,33,54,39]]}
[]
[]
[null,null,null,null,null,null,null,null,null,null,null,null,null,null,null,null,null,null,null,null,null,null,null,"Specification Requirements for SMA",null,null,null,null,null,null,null,null,null,null,null,null,null,null,null,null,null,null,null,null,null,null,null,null,null,null,null,null,null,null,null,null,null,null,null,null,null,null,null,null,null,"    SUPERPAVE SPECIFICATION REFERENCES"]
[null,null,null,null,null,null,null,null,null,null,null,null,null,null,null,null,null,null,null,null,null,null,null,null,null,null,null,null,null,null,null,null,null,null,null,null,null,null,null,null,null,null,null,null,null,null,null,null,null,null,null,null,null,null,null,null,null,null,null,null,null,null,null,null,null,null,"Revision to AASHTO R35 Bulletin 27 change 3",null,null,null,null,"Revision to AASHTO M323 Bulletin 27 change 3"]
[null,null,null,null,null,null,null,null,null,null,null,null,null,null,null,null,null,null,null,null,null,null,null,null,null,null,null,null,null,null,null,null,null,null,null,null,null,null,null,null,null,null,null,null,null,null,null,null,null,null,null,null,null,null,null,null,null,null,null,null,null,null,null,null,null,null,"Table 1 - Gyratory Compaction Effort",null,null,null,null,"Table 5 - Superpave Aggregate Consensus Property Requirements"]
[null,null,null,null,null,null,null,null,null,null,null,null,null,null,null,null,null,null,null,null,null,null,null,"Aggregate Quality Requirements",null,null,null,null,null,null,null,null,null,null,null,null,null,null,null,null,null,null,null,null,null,null,null,null,null,null,null,null,null,null,null,null,null,null,null,null,null,null,null,null,null,null,"Design ESALs (millions)","Compaction Parameters",null,null,null,"Design ESALs (millions)",null,"Coarse Aggregate Angularity (Percent), minimum",null,"Uncompacted Voids of Fine Aggregate (Percent), minimum",null,"Sand Equivalent (Percent), minimum","Flat and Elongated (Percent), maximum"]
[null,null,null,null,null,null,null,null,null,null,null,null,null,null,null,null,null,null,null,null,null,null,null,"Characteristic",null,null,null,null,null,null,null,null,null,null,"Required Values",null,null,null,null,null,null,null,null,null,null,null,null,null,null,null,null,null,null,null,null,null,null,null,null,null,null,null,null,null,null,null,null,"Ninitial","Ndesign","Nmax"]
[null,null,null,null,null,null,null,null,null,null,null,null,null,null,null,null,null,null,null,null,null,null,null,"Abrasion, Max %.",null,null,null,null,null,null,null,null,null,null,35,null,null,null,null,null,null,null,null,null,null,null,null,null,null,null,null,null,null,null,null,null,null,null,null,null,null,null,null,null,null,null,"<0.3",6,50,75,null,null,null,"£ 100 mm","> 100 mm","£ 100 mm","> 100 mm"]
[null,null,null,null,null,null,null,null,null,null,null,null,null,null,null,null,null,null,null,null,null,null,null,"Flat and Elongates Particles, % Max. ASTM D 4791",null,null,null,null,null,null,null,null,null,null,null,null,null,null,null,null,null,null,null,null,null,null,null,null,null,null,null,null,null,null,null,null,null,null,null,null,null,null,null,null,null,null,"0.3 to < 3",7,75,115,null,"<0.3",null,"55/-","-/-","-","-",40,"-"]
[null,null,null,null,null,null,null,null,null,null,null,null,null,null,null,null,null,null,null,null,null,null,null,"(measured by mass or by material retained on or above ",null,null,null,null,null,null,null,null,null,null,null,null,null,null,null,null,null,null,null,null,null,null,null,null,null,null,null,null,null,null,null,null,null,null,null,null,null,null,null,null,null,null,"3 to < 30",8,100,160,null,"0.3 to < 3",null,"75/-","50/-",40,40,40,10]
[null,null,null,null,null,null,null,null,null,null,null,null,null,null,null,null,null,null,null,null,null,null,null,"the #4 sieve)",null,null,null,null,null,null,null,null,null,null,null,null,null,null,null,null,null,null,null,null,null,null,null,null,null,null,null,null,null,null,null,null,null,null,null,null,null,null,null,null,null,null,null,null,null,null,null,"3 to < 10",null,"85/80","60/-",45,40,45]
[null,null,null,null,null,null,null,null,null,null,null,null,null,null,null,null,null,null,null,null,null,null,null,"3:1",null,null,null,null,null,null,null,null,null,null,20,null,null,null,null,null,null,null,null,null,null,null,null,null,null,null,null,null,null,null,null,null,null,null,null,null,null,null,null,null,null,null,null,null,null,null,null,"3 to < 30",null,"95/90","80/75",45,40,45]
[null,null,null,null,null,null,null,null,null,null,null,null,null,null,null,null,null,null,null,null,null,null,null,"5:1",null,null,null,null,null,null,null,null,null,null,10,null,null,null,null,null,null,null,null,null,null,null,null,null,null,null,null,null,null,null,null,null,null,null,null,null,null,null,null,null,null,null,null,null,null,null,null,"³ 30",null,"95/90","95/90",45,45,50]
[null,null,null,null,null,null,null,null,null,null,null,null,null,null,null,null,null,null,null,null,null,null,null,"Absorption, Max % AASHTO T85",null,null,null,null,null,null,null,null,null,null,2,null,null,null,null,null,null,null,null,null,null,null,null,null,null,null,null,null,null,null,null,null,null,null,null,null,null,null,null,null,null,"Revision to AASHTO M323 Bulletin 27 change 3"]
[null,null,null,null,null,null,null,null,null,null,null,null,null,null,null,null,null,null,null,null,null,null,null,"Crushed fragments, Min %",null,null,null,null,null,null,null,null,null,null,"100 for one fractured face",null,null,null,null,null,null,null,null,null,null,null,null,null,null,null,null,null,null,null,null,null,null,null,null,null,null,null,null,null,null,"Table 6 - Superpave Volumetric Mixture Design Requirements"]
[null,null,null,null,null,null,null,null,null,null,null,null,null,null,null,null,null,null,null,null,null,null,null,null,null,null,null,null,null,null,null,null,null,null,"90 for two fractured faces",null,null,null,null,null,null,null,null,null,null,null,null,null,null,null,null,null,null,null,null,null,null,null,null,null,null,null,null,null,null,"Design ESALs (millions)","Required Density (% of Theoretical Maximum Specific Gravity)",null,null,"Voids-in-the Mineral Aggregate, (Percent) minimum",null,null,null,null,null,"Voids Filled With Asphalt (Percent) minimum"]
[null,null,null,null,null,null,null,null,null,null,null,null,null,null,null,null,null,null,null,null,null,null,null,null,null,null,null,null,null,null,null,null,null,null,null,null,null,null,null,null,null,null,null,null,null,null,null,null,null,null,null,null,null,null,null,null,null,null,null,null,null,null,null,null,null,null,"Ninitial","Ndesign","Nmax","Nominal Maximum Aggregate Size, mm",null,null,null,null,null,"Nominal Maximum Aggregate Size, mm"]
[null,null,null,null,null,null,null,null,null,null,null,null,null,null,null,null,null,null,null,null,null,null,null,null,null,null,null,null,"Mix Design Reqqirements for SMA",null,null,null,null,null,null,null,null,null,null,null,null,null,null,null,null,null,null,null,null,null,null,null,null,null,null,null,null,null,null,null,null,null,null,null,null,null,null,null,null,37.5,25,19,12.5,9.5,4.75,37.5,25,19,12.5,9.5,4.75]
[null,null,null,null,null,null,null,null,null,null,null,null,null,null,null,null,null,null,null,null,null,null,null,null,null,null,null,null,"Aggregate Gradation Requirements, Percent passing",null,null,null,null,null,null,null,null,null,null,null,null,null,null,null,null,null,null,null,null,null,null,null,null,null,null,null,null,null,null,null,null,null,null,null,null,"<0.3","£91.5","96.0","£98.0",11.5,12.5,13.5,15,16,16,"65-78","68-78","70-78","73-78","75-78","75-78"]
[null,null,null,null,null,null,null,null,null,null,null,null,null,null,null,null,null,null,null,null,null,null,null,null,null,null,null,null,"Sieve Size",null,null,null,null,null,"9.5 mm",null,null,"12.5 mm",null,null,null,null,null,null,null,null,null,null,null,null,null,null,null,null,null,null,null,null,null,null,null,null,null,null,null,"0.3 to < 3","£90.5",null,null,11.5,12.5,13.5,15,16,16,"65-78","68-78","70-78","73-78","75-78","75-78"]
[null,null,null,null,null,null,null,null,null,null,null,null,null,null,null,null,null,null,null,null,null,null,null,null,null,null,null,null,"19.0mm (3/4)",null,null,null,null,null,null,null,null,100,null,null,null,null,null,null,null,null,null,null,null,null,null,null,null,null,null,null,null,null,null,null,null,null,null,null,null,"3 to < 10","£89.0",null,null,11.5,12.5,13.5,15,15.5,16,"65-75","68-75","70-75.","73-75","75-76","75-78"]
[null,null,null,null,null,null,null,null,null,null,null,null,null,null,null,null,null,null,null,null,null,null,null,null,null,null,null,null,"12.5mm (1/2)",null,null,null,null,null,100,null,null,"90-99",null,null,null,null,null,null,null,null,null,null,null,null,null,null,null,null,null,null,null,null,null,null,null,null,null,null,null,"3 to < 30",null,null,null,11.5,12.5,13.5,15,15.5,16,"65-75","68-75","70-75","73-75","75-76","75-78"]
[null,null,null,null,null,null,null,null,null,null,null,null,null,null,null,null,null,null,null,null,null,null,null,null,null,null,null,null,"9.5mm (3/8)",null,null,null,null,null,"75-95",null,null,"70-85",null,null,null,null,null,null,null,null,null,null,null,null,null,null,null,null,null,null,null,null,null,null,null,null,null,null,null,"³ 30",null,null,null,11.5,12.5,13.5,15,15.5,16,"65-75","68-75","70-75","73-75","75-76","75-78"]
[null,null,null,null,null,null,null,null,null,null,null,null,null,null,null,null,null,null,null,null,null,null,null,null,null,null,null,null,"4.75mm (No 4)",null,null,null,null,null,"30-50",null,null,"28-40",null,null,null,null,null,null,null,null,null,null,null,null,null,null,null,null,null,null,null,null,null,null,null,null,null,null,null,"Dust-to-Binder Ratio",null,null,null,"0.6 -1.2"]
[null,null,null,null,null,null,null,null,null,null,null,null,null,null,null,null,null,null,null,null,null,null,null,null,null,null,null,null,"2.36mm (No 8)",null,null,null,null,null,"20-30",null,null,"18-30",null,null,null,null,null,null,null,null,null,null,null,null,null,null,null,null,null,null,null,null,null,null,null,null,null,null,null,null,null,"Revision to AASHTO M323 Bulletin 27 change 3"]
[null,null,null,null,null,null,null,null,null,null,null,null,null,null,null,null,null,null,null,null,null,null,null,null,null,null,null,null,"1.18mm (No 16)",null,null,null,null,null,"-",null,null,"-",null,null,null,null,null,null,null,null,null,null,null,null,null,null,null,null,null,null,null,null,null,null,null,null,null,null,null,null,null,"Table 3 - Aggregate Gradation Control Points"]
[null,null,null,null,null,null,null,null,null,null,null,null,null,null,null,null,null,null,null,null,null,null,null,null,null,null,null,null,"600μm (No 30)",null,null,null,null,null,"-",null,null,"-",null,null,null,null,null,null,null,null,null,null,null,null,null,null,null,null,null,null,null,null,null,null,null,null,null,null,null,null,null,"Nominal Maximum Aggregate Size - Control Points (Percent Passing)"]
[null,null,null,null,null,null,null,null,null,null,null,null,null,null,null,null,null,null,null,null,null,null,null,null,null,null,null,null,"300μm (No 50)",null,null,null,null,null,"-",null,null,"-",null,null,null,null,null,null,null,null,null,null,null,null,null,null,null,null,null,null,null,null,null,null,null,null,null,null,null,null,null,"37.5 mm",null,"25.0 mm",null,"19.0 mm",null,"12.5 mm",null,"9.5 mm",null,"4.75 mm"]
[null,null,null,null,null,null,null,null,null,null,null,null,null,null,null,null,null,null,null,null,null,null,null,null,null,null,null,null,"150μm (No 100)",null,null,null,null,null,"-",null,null,"-",null,null,null,null,null,null,null,null,null,null,null,null,null,null,null,null,null,null,null,null,null,null,null,null,null,null,null,null,"Sieve Size","Min.","Max.","Min.","Max.","Min.","Max.","Min.","Max.","Min.","Max.","Min.","Max."]
[null,null,null,null,null,null,null,null,null,null,null,null,null,null,null,null,null,null,null,null,null,null,null,null,null,null,null,null,".075μm (No 200)",null,null,null,null,null,"8-13",null,null,"8-11",null,null,null,null,null,null,null,null,null,null,null,null,null,null,null,null,null,null,null,null,null,null,null,null,null,null,null,null,"50mm",100]
[null,null,null,null,null,null,null,null,null,null,null,null,null,null,null,null,null,null,null,null,null,null,null,null,null,null,null,null,null,null,null,null,null,null,null,null,null,null,null,null,null,null,null,null,null,null,null,null,null,null,null,null,null,null,null,null,null,null,null,null,null,null,null,null,null,null,"37.5mm",90,100,100]
[null,null,null,null,null,null,null,null,null,null,null,null,null,null,null,null,null,null,null,null,null,null,null,null,null,null,null,null,"Volumetric Design Requirements",null,null,null,null,null,null,null,null,null,null,null,null,null,null,null,null,null,null,null,null,null,null,null,null,null,null,null,null,null,null,null,null,null,null,null,null,null,"25.0mm",null,89,90,100,100]
[null,null,null,null,null,null,null,null,null,null,null,null,null,null,null,null,null,null,null,null,null,null,null,null,null,null,null,null,"Design Gyrations",null,null,null,null,100,null,null,null,null,null,null,null,null,null,null,null,null,null,null,null,null,null,null,null,null,null,null,null,null,null,null,null,null,null,null,null,null,"19.0mm",null,null,null,89,90,100,100]
[null,null,null,null,null,null,null,null,null,null,null,null,null,null,null,null,null,null,null,null,null,null,null,null,null,null,null,null,"VMA",null,null,null,null,"18.0 % Min.",null,null,null,null,null,null,null,null,null,null,null,null,null,null,null,null,null,null,null,null,null,null,null,null,null,null,null,null,null,null,null,null,"12.5mm",null,null,null,null,null,89,90,100,100,null,100]
[null,null,null,null,null,null,null,null,null,null,null,null,null,null,null,null,null,null,null,null,null,null,null,null,null,null,null,null,"Coarse Agg. Structure",null,null,null,null,"VCAMIX < VCADRC",null,null,null,null,null,null,null,null,null,null,null,null,null,null,null,null,null,null,null,null,null,null,null,null,null,null,null,null,null,null,null,null,"9.5mm",null,null,null,null,null,null,null,89,90,100,95,100]
[null,null,null,null,null,null,null,null,null,null,null,null,null,null,null,null,null,null,null,null,null,null,null,null,null,null,null,null,"Design Air Voids",null,null,null,null,"3.5 - 4.0 %",null,null,null,null,null,null,null,null,null,null,null,null,null,null,null,null,null,null,null,null,null,null,null,null,null,null,null,null,null,null,null,null,"4.75mm",null,null,null,null,null,null,null,null,null,89,89,100]
[null,null,null,null,null,null,null,null,null,null,null,null,null,null,null,null,null,null,null,null,null,null,null,null,null,null,null,null,"Binder Grade",null,null,null,null,"PG 76-22",null,null,null,null,null,null,null,null,null,null,null,null,null,null,null,null,null,null,null,null,null,null,null,null,null,null,null,null,null,null,null,null,"2.36mm",15,41,19,45,23,49,28,58,32,67]
[null,null,null,null,null,null,null,null,null,null,null,null,null,null,null,null,null,null,null,null,null,null,null,null,null,null,null,null,"Stabilizer Content",null,null,null,null,"Celulose: 0.2 to 0.4 by total mix wt.",null,null,null,null,null,null,null,null,null,null,null,null,null,null,null,null,null,null,null,null,null,null,null,null,null,null,null,null,null,null,null,null,"1.18mm",null,null,null,null,null,null,null,null,null,null,30,60]
[null,null,null,null,null,null,null,null,null,null,null,null,null,null,null,null,null,null,null,null,null,null,null,null,null,null,null,null,null,null,null,null,null,"Mineral: 0.3 to 0.4 by total mix wt.",null,null,null,null,null,null,null,null,null,null,null,null,null,null,null,null,null,null,null,null,null,null,null,null,null,null,null,null,null,null,null,null,"600µm"]
[null,null,null,null,null,null,null,null,null,null,null,null,null,null,null,null,null,null,null,null,null,null,null,null,null,null,null,null,"Draindown",null,null,null,null,"0.3 maximum",null,null,null,null,null,null,null,null,null,null,null,null,null,null,null,null,null,null,null,null,null,null,null,null,null,null,null,null,null,null,null,null,"300µm"]
[null,null,null,null,null,null,null,null,null,null,null,null,null,null,null,null,null,null,null,null,null,null,null,null,null,null,null,null,null,null,null,null,null,null,null,null,null,null,null,null,null,null,null,null,null,null,null,null,null,null,null,null,null,null,null,null,null,null,null,null,null,null,null,null,null,null,"150µm"]
[null,null,null,null,null,null,null,null,null,null,null,null,null,null,null,null,null,null,null,null,null,null,null,null,null,null,null,null,"Minimum Asphalt  Requiremnets for SMA Mixtures",null,null,null,null,null,null,null,null,null,null,null,null,null,null,null,null,null,null,null,null,null,null,null,null,null,null,null,null,null,null,null,null,null,null,null,null,null,"75µm",0,6,1,7,2,8,2,10,2,10,6,12]
[null,null,null,null,null,null,null,null,null,null,null,null,null,null,null,null,null,null,null,null,null,null,null,null,null,null,null,null,"Combined Aggregate",null,null,null,null,"Minimin Asphalt Content % by"]
[null,null,null,null,null,null,null,null,null,null,null,null,null,null,null,null,null,null,null,null,null,null,null,null,null,null,null,null,"Bulk Specific Gravity",null,null,null,null,"Total Mix Weight",null,null,null,null,null,null,null,null,null,null,null,null,null,null,null,null,null,null,null,null,null,null,null,null,null,null,null,null,null,null,null,null,null,null,"AASHTO M323"]
[null,null,null,null,null,null,null,null,null,null,null,null,null,null,null,null,null,null,null,null,null,null,null,null,null,null,null,null,2.4,null,null,null,null,7.4,null,null,null,null,null,null,null,null,null,null,null,null,null,null,null,null,null,null,null,null,null,null,null,null,null,null,null,null,null,null,null,null,null,null,"Table 4 - PCS Control Point for Mixture Nominal Maximum Aggregate Size"]
[null,null,null,null,null,null,null,null,null,null,null,null,null,null,null,null,null,null,null,null,null,null,null,null,null,null,null,null,2.4500000000000002,null,null,null,null,7.2,null,null,null,null,null,null,null,null,null,null,null,null,null,null,null,null,null,null,null,null,null,null,null,null,null,null,null,null,null,null,null,null,null,null,"Nominal Maximum Aggregate Size",null,null,"37.5 mm","25.0 mm","19.0 mm","12.5 mm","9.5 mm"]
[null,null,null,null,null,null,null,null,null,null,null,null,null,null,null,null,null,null,null,null,null,null,null,null,null,null,null,null,2.5,null,null,null,null,7.1,null,null,null,null,null,null,null,null,null,null,null,null,null,null,null,null,null,null,null,null,null,null,null,null,null,null,null,null,null,null,null,null,null,null,"Primary Control Sieve",null,null,"9.5 mm","4.75 mm","4.75 mm","2.36 mm","2.36 mm"]
[null,null,null,null,null,null,null,null,null,null,null,null,null,null,null,null,null,null,null,null,null,null,null,null,null,null,null,null,2.5499999999999998,null,null,null,null,7]
[null,null,null,null,null,null,null,null,null,null,null,null,null,null,null,null,null,null,null,null,null,null,null,null,null,null,null,null,2.6,null,null,null,null,6.8]
[null,null,null,null,null,null,null,null,null,null,null,null,null,null,null,null,null,null,null,null,null,null,null,null,null,null,null,null,2.65,null,null,null,null,6.7]
[null,null,null,null,null,null,null,null,null,null,null,null,null,null,null,null,null,null,null,null,null,null,null,null,null,null,null,null,2.7,null,null,null,null,6.6]
[null,null,null,null,null,null,null,null,null,null,null,null,null,null,null,null,null,null,null,null,null,null,null,null,null,null,null,null,2.75,null,null,null,null,6.5,null,null,null,null,null,null,null,null,null,null,null,null,null,null,null,null,null,null,null,null,null,null,null,null,null,null,null,null,null,null,null,null,null,null,"PCS Control Point (% Passing)",null,null,47,40,47,39,47]
[null,null,null,null,null,null,null,null,null,null,null,null,null,null,null,null,null,null,null,null,null,null,null,null,null,null,null,null,2.8,null,null,null,null,6.4]
[null,null,null,null,null,null,null,null,null,null,null,null,null,null,null,null,null,null,null,null,null,null,null,null,null,null,null,null,2.85,null,null,null,null,6.3]
[null,null,null,null,null,null,null,null,null,null,null,null,null,null,null,null,null,null,null,null,null,null,null,null,null,null,null,null,2.9,null,null,null,null,6.2]
[null,null,null,null,null,null,null,null,null,null,null,null,null,null,null,null,null,null,null,null,null,null,null,null,null,null,null,null,2.95,null,null,null,null,6.1]
[null,null,null,null,null,null,null,null,null,null,null,null,null,null,null,null,null,null,null,null,null,null,null,null,null,null,null,null,3,null,null,null,null,6]

{"sheet":"Agg Blends","index":2,"n_rows":66,"n_cols":59,"rows_kept":66,"cut":false,"hidden":false,"merged":[[4,1,4,2],[4,3,4,4],[4,9,4,10],[4,11,4,12],[4,5,4,6],[2,1,2,14],[3,1,3,2],[3,3,3,4],[3,9,3,10],[3,11,3,12],[3,5,3,6],[3,7,3,8],[29,20,29,22],[12,2,12,5],[12,6,12,7],[12,8,12,9],[13,6,13,7],[13,8,13,9],[17,13,17,14],[17,10,17,12],[15,2,15,5],[15,6,15,7],[15,8,15,9],[17,1,17,2],[17,3,17,9],[40,1,40,12],[14,6,14,7],[14,8,14,9],[5,1,5,2],[5,3,5,4],[5,9,5,10],[5,11,5,12],[7,10,7,12],[9,2,9,5],[9,6,9,7],[9,8,9,9],[8,2,8,5],[8,6,8,7],[8,8,8,9],[5,5,5,6],[54,7,54,8],[54,18,54,19],[54,20,54,21],[45,1,45,9],[46,2,46,9],[34,55,34,56],[10,2,10,5],[39,20,39,22],[10,6,10,7],[10,8,10,9],[11,2,11,5],[11,6,11,7],[11,8,11,9],[18,21,18,23],[39,23,39,25],[29,23,29,25],[33,1,33,9],[13,2,13,5],[14,2,14,5],[39,26,39,28],[29,26,29,28]]}
[null,{"$f":"Setup!A2","v":"ESB-19"},null,null,null,null,null,null,null,null,null,null,null,null,null,null,null,null,null,null,null,null,null,null,null,null,null,null,null,{"$f":"Setup!E9","v":0}]
[]
[null,"Aggregate Gradations and Consensus Properties"]
[null,"Producer:",null,{"$f":"Setup!E7","v":0},null,"Material Class:",null,{"$f":"Setup!E10","v":"00:00:00"},null,"Nominal Size:",null,{"$f":"Setup!E9","v":0}]
[null,"Designed By:",null,{"$f":"Setup!E8","v":0},null,"Esals:",null,{"$f":"Setup!E12","v":0},null,"SRL:",null,{"$f":"Setup!E11","v":0}]
[null,"Date:",null,{"$f":"Setup!E6","v":"00:00:00"},null," Rap:",null,{"$f":"Setup!E17","v":0},null,"PG Grade",null,{"$f":"Setup!E14","v":0}]
[]
[null,null,null,null,null,null,null,null,null,null,"% in Blend"]
[null,null,"Supplier Name",null,null,null,"Supplier Code",null,"Material Class",null,"Blend 1","Blend 2","Blend 3"]
[null,"Agg 1"]
[null,"Agg 2"]
[null,"Agg 3"]
[null,"Agg 4"]
[null,"Agg 5"]
[null,"Agg 6"]
[null,"Agg 7"]
[null,null,null,null,null,null,null,null,null,"Sum",{"$f":"IF(K10,SUM(K10:K16),\" \")","v":" "},{"$f":"IF(L10,SUM(L10:L16),\" \")","v":" "},{"$f":"IF(M10,SUM(M10:M16),\" \")","v":" "}]
[null,"Sieve Size",null,"Aggregate Gradations",null,null,null,null,null,null,"Trial Blends",null,null,"Specs"]
[null,"Metric","Standard","Agg 1","Agg 2","Agg 3","Agg 4","Agg 5","Agg 6","Agg 7","Blend 1","Blend 2","Blend 3","Min","Max",null,null,null,null,null,null,"4.75 / 9.5mm",null,null,null,null,"12.5mm",null,null,null,"19mm",null,null,null,"25mm",null,null,null,"37.5mm"]
[null,"50.0mm","2\"",null,null,null,null,null,null,null,null,null,null,{"$f":"'.45 Power'!E4","v":" "},{"$f":"'.45 Power'!F4","v":0},null,null,null,null,null,null,null,null,null,null,null,null,null,null,null,null,null,null,null,null,null,null,{"$f":"(((($D20*$K$10)+($E20*$K$11)+($F20*$K$12)+($G20*$K$13)+($H20*$K$14)+($I20*$K$15)+($J20*$K$16))/100))","v":0},{"$f":"(((($D20*$L$10)+($E20*$L$11)+($F20*$L$12)+($G20*$L$13)+($H20*$L$14)+($I20*$L$15)+($J20*$L$16))/100))","v":0},{"$f":"(((($D20*$M$10)+($E20*$M$11)+($F20*$M$12)+($G20*$M$13)+($H20*$M$14)+($I20*$M$15)+($J20*$M$16))/100))","v":0}]
[null,"37.5mm","1 1/2\"",null,null,null,null,null,null,null,null,null,null,{"$f":"'.45 Power'!E5","v":false},{"$f":"'.45 Power'!F5","v":false},null,null,null,null,null,null,null,null,null,null,null,null,null,null,null,null,null,null,{"$f":"(((($D21*$K$10)+($E21*$K$11)+($F21*$K$12)+($G21*$K$13)+($H21*$K$14)+($I21*$K$15)+($J21*$K$16))/100))","v":0},{"$f":"(((($D21*$L$10)+($E21*$L$11)+($F21*$L$12)+($G21*$L$13)+($H21*$L$14)+($I21*$L$15)+($J21*$L$16))/100))","v":0},{"$f":"(((($D21*$M$10)+($E21*$M$11)+($F21*$M$12)+($G21*$M$13)+($H21*$M$14)+($I21*$M$15)+($J21*$M$16))/100))","v":0},null,{"$f":"(((($D21*$K$10)+($E21*$K$11)+($F21*$K$12)+($G21*$K$13)+($H21*$K$14)+($I21*$K$15)+($J21*$K$16))/100))","v":0},{"$f":"(((($D21*$L$10)+($E21*$L$11)+($F21*$L$12)+($G21*$L$13)+($H21*$L$14)+($I21*$L$15)+($J21*$L$16))/100))","v":0},{"$f":"(((($D21*$M$10)+($E21*$M$11)+($F21*$M$12)+($G21*$M$13)+($H21*$M$14)+($I21*$M$15)+($J21*$M$16))/100))","v":0}]
[null,"25.0mm","1\"",null,null,null,null,null,null,null,null,null,null,{"$f":"'.45 Power'!E6","v":false},{"$f":"'.45 Power'!F6","v":false},null,null,null,null,null,null,null,null,null,null,null,null,null,null,{"$f":"(((($D22*$K$10)+($E22*$K$11)+($F22*$K$12)+($G22*$K$13)+($H22*$K$14)+($I22*$K$15)+($J22*$K$16))/100))","v":0},{"$f":"(((($D22*$L$10)+($E22*$L$11)+($F22*$L$12)+($G22*$L$13)+($H22*$L$14)+($I22*$L$15)+($J22*$L$16))/100))","v":0},{"$f":"(((($D22*$M$10)+($E22*$M$11)+($F22*$M$12)+($G22*$M$13)+($H22*$M$14)+($I22*$M$15)+($J22*$M$16))/100))","v":0},null,{"$f":"(((($D22*$K$10)+($E22*$K$11)+($F22*$K$12)+($G22*$K$13)+($H22*$K$14)+($I22*$K$15)+($J22*$K$16))/100))","v":0},{"$f":"(((($D22*$L$10)+($E22*$L$11)+($F22*$L$12)+($G22*$L$13)+($H22*$L$14)+($I22*$L$15)+($J22*$L$16))/100))","v":0},{"$f":"(((($D22*$M$10)+($E22*$M$11)+($F22*$M$12)+($G22*$M$13)+($H22*$M$14)+($I22*$M$15)+($J22*$M$16))/100))","v":0},null,{"$f":"(((($D22*$K$10)+($E22*$K$11)+($F22*$K$12)+($G22*$K$13)+($H22*$K$14)+($I22*$K$15)+($J22*$K$16))/100))","v":0},{"$f":"(((($D22*$L$10)+($E22*$L$11)+($F22*$L$12)+($G22*$L$13)+($H22*$L$14)+($I22*$L$15)+($J22*$L$16))/100))","v":0},{"$f":"(((($D22*$M$10)+($E22*$M$11)+($F22*$M$12)+($G22*$M$13)+($H22*$M$14)+($I22*$M$15)+($J22*$M$16))/100))","v":0}]
[null,"19.0mm","3/4\"",null,null,null,null,null,null,null,null,null,null,{"$f":"'.45 Power'!E7","v":false},{"$f":"'.45 Power'!F7","v":false},null,null,null,null,null,null,null,null,null,null,{"$f":"(($D23*$K$10)+($E23*$K$11)+($F23*$K$12)+($G23*$K$13)+($H23*$K$14)+($I23*$K$15)+($J23*$K$16))/100","v":0},{"$f":"(($D23*$L$10)+($E23*$L$11)+($F23*$L$12)+($G23*$L$13)+($H23*$L$14)+($I23*$L$15)+($J23*$L$16))/100","v":0},{"$f":"(($D23*$M$10)+($E23*$M$11)+($F23*$M$12)+($G23*$M$13)+($H23*$M$14)+($I23*$M$15)+($J23*$M$16))/100","v":0},null,{"$f":"(((($D23*$K$10)+($E23*$K$11)+($F23*$K$12)+($G23*$K$13)+($H23*$K$14)+($I23*$K$15)+($J23*$K$16))/100))","v":0},{"$f":"(((($D23*$L$10)+($E23*$L$11)+($F23*$L$12)+($G23*$L$13)+($H23*$L$14)+($I23*$L$15)+($J23*$L$16))/100))","v":0},{"$f":"(((($D23*$M$10)+($E23*$M$11)+($F23*$M$12)+($G23*$M$13)+($H23*$M$14)+($I23*$M$15)+($J23*$M$16))/100))","v":0},null,{"$f":"(((($D23*$K$10)+($E23*$K$11)+($F23*$K$12)+($G23*$K$13)+($H23*$K$14)+($I23*$K$15)+($J23*$K$16))/100))","v":0},{"$f":"(((($D23*$L$10)+($E23*$L$11)+($F23*$L$12)+($G23*$L$13)+($H23*$L$14)+($I23*$L$15)+($J23*$L$16))/100))","v":0},{"$f":"(((($D23*$M$10)+($E23*$M$11)+($F23*$M$12)+($G23*$M$13)+($H23*$M$14)+($I23*$M$15)+($J23*$M$16))/100))","v":0},null,{"$f":"(((($D23*$K$10)+($E23*$K$11)+($F23*$K$12)+($G23*$K$13)+($H23*$K$14)+($I23*$K$15)+($J23*$K$16))/100))","v":0},{"$f":"(((($D23*$L$10)+($E23*$L$11)+($F23*$L$12)+($G23*$L$13)+($H23*$L$14)+($I23*$L$15)+($J23*$L$16))/100))","v":0},{"$f":"(((($D23*$M$10)+($E23*$M$11)+($F23*$M$12)+($G23*$M$13)+($H23*$M$14)+($I23*$M$15)+($J23*$M$16))/100))","v":0}]
[null,"12.5mm","1/2\"",null,null,null,null,null,null,null,null,null,null,{"$f":"'.45 Power'!E8","v":false},{"$f":"'.45 Power'!F8","v":false}]
[null,"9.5mm","3/8\"",null,null,null,null,null,null,null,{"$f":"IF(ISTEXT(K11),\" \",(((($D25*$K$10)+($E25*$K$11)+($F25*$K$12)+($G25*$K$13)+($H25*$K$14)+($I25*$K$15)+($J25*$K$16))/100)+($K$34))/(100+$K$34)%)","v":0},{"$f":"IF(ISTEXT(L11),\" \",(((($D25*$L$10)+($E25*$L$11)+($F25*$L$12)+($G25*$L$13)+($H25*$L$14)+($I25*$L$15)+($J25*$L$16))/100)+($L$34))/(100+$L$34)%)","v":0},{"$f":"IF(ISTEXT(M11),\" \",(((($D25*$M$10)+($E25*$M$11)+($F25*$M$12)+($G25*$M$13)+($H25*$M$14)+($I25*$M$15)+($J25*$M$16))/100)+($M$34))/(100+$M$34)%)","v":0},{"$f":"'.45 Power'!E9","v":false},{"$f":"'.45 Power'!F9","v":false}]
[null,"6.33mm","1/4\"",null,null,null,null,null,null,null,{"$f":"IF(ISTEXT(K12),\" \",(((($D26*$K$10)+($E26*$K$11)+($F26*$K$12)+($G26*$K$13)+($H26*$K$14)+($I26*$K$15)+($J26*$K$16))/100)+($K$34))/(100+$K$34)%)","v":0},{"$f":"IF(ISTEXT(L12),\" \",(((($D26*$L$10)+($E26*$L$11)+($F26*$L$12)+($G26*$L$13)+($H26*$L$14)+($I26*$L$15)+($J26*$L$16))/100)+($L$34))/(100+$L$34)%)","v":0},{"$f":"IF(ISTEXT(M12),\" \",(((($D26*$M$10)+($E26*$M$11)+($F26*$M$12)+($G26*$M$13)+($H26*$M$14)+($I26*$M$15)+($J26*$M$16))/100)+($M$34))/(100+$M$34)%)","v":0},{"$f":"'.45 Power'!E10","v":false},{"$f":"'.45 Power'!F10","v":false}]
[null,"4.75mm","#4",null,null,null,null,null,null,null,{"$f":"IF(ISTEXT(K12),\" \",(((($D27*$K$10)+($E27*$K$11)+($F27*$K$12)+($G27*$K$13)+($H27*$K$14)+($I27*$K$15)+($J27*$K$16))/100)+($K$34))/(100+$K$34)%)","v":0},{"$f":"IF(ISTEXT(L12),\" \",(((($D27*$L$10)+($E27*$L$11)+($F27*$L$12)+($G27*$L$13)+($H27*$L$14)+($I27*$L$15)+($J27*$L$16))/100)+($L$34))/(100+$L$34)%)","v":0},{"$f":"IF(ISTEXT(M12),\" \",(((($D27*$M$10)+($E27*$M$11)+($F27*$M$12)+($G27*$M$13)+($H27*$M$14)+($I27*$M$15)+($J27*$M$16))/100)+($M$34))/(100+$M$34)%)","v":0},{"$f":"'.45 Power'!E11","v":false},{"$f":"'.45 Power'!F11","v":false}]
[null,"2.36mm","#8",null,null,null,null,null,null,null,0,0,0,{"$f":"'.45 Power'!E12","v":false},{"$f":"'.45 Power'!F12","v":false}]
[null,"1.18mm","#16",null,null,null,null,null,null,null,0,0,0,{"$f":"'.45 Power'!E13","v":false},{"$f":"'.45 Power'!F13","v":false}]
[null,"600µm","#30",null,null,null,null,null,null,null,0,0,0,{"$f":"'.45 Power'!E14","v":false},{"$f":"'.45 Power'!F14","v":false},null,null,null,null,null,"Gsb Blend 1",null,null,"Gsb Blend 2",null,null,"Gsb Blend 3"]
[null,"300µm","#50",null,null,null,null,null,null,null,0,0,0,{"$f":"'.45 Power'!E15","v":false},{"$f":"'.45 Power'!F15","v":false},null,null,null,null,null,{"$f":"K10","v":0},{"$f":"D35","v":0},{"$f":"IF(U31=0,0,U31/V31)","v":0},{"$f":"L10","v":0},{"$f":"D35","v":0},{"$f":"IF(X31=0,0,X31/Y31)","v":0},{"$f":"M10","v":0},{"$f":"D35","v":0},{"$f":"IF(AA31=0,0,AA31/AB31)","v":0}]
[null,"150µm","#100",null,null,null,null,null,null,null," "," "," ",{"$f":"'.45 Power'!E16","v":false},{"$f":"'.45 Power'!F16","v":false},null,null,null,null,null,0,{"$f":"E35","v":0},0,0,{"$f":"E35","v":0},{"$f":"IF(X32=0,0,X32/Y32)","v":0},0,{"$f":"E35","v":0},0]
[null,"75µm","#200",null,null,null,null,null,null,null,{"$f":"IF(D33,(((($D33*$K$10)+($E33*$K$11)+($F33*$K$12)+($G33*$K$13)+($H33*$K$14)+($I33*$K$15)+($J33*$K$16))/100)))+K34","v":0},{"$f":"IF(D33,(((($D33*$L$10)+($E33*$L$11)+($F33*$L$12)+($G33*$L$13)+($H33*$L$14)+($I33*$L$15)+($J33*$L$16))/100)))+L34","v":0},{"$f":"IF(D33,(((($D33*$M$10)+($E33*$M$11)+($F33*$M$12)+($G33*$M$13)+($H33*$M$14)+($I33*$M$15)+($J33*$M$16))/100)))+M34","v":0},{"$f":"'.45 Power'!E17","v":false},{"$f":"'.45 Power'!F17","v":false},null,null,null,null,null,0,{"$f":"F35","v":0},0,0,{"$f":"F35","v":0},0,0,{"$f":"F35","v":0},0]
[null,"If needed, enter the % fines that will be removed through ther bag house ( - )",null,null,null,null,null,null,null,null,null,null,null,null,null,null,null,null,null,null,0,{"$f":"G35","v":0},0,0,{"$f":"G35","v":0},0,0,{"$f":"G35","v":0},0]
[null,"Bulk SpGr (Gsb)",null,null,null,null,null,null,null,null,{"$f":"IF(ISTEXT($K$17),\"\",W39)","v":""},{"$f":"IF(ISTEXT($K$17),\"\",Z39)","v":""},{"$f":"IF(ISTEXT($M$17),\"\",AC39)","v":""},null,null,null,null,null,null,null,0,{"$f":"H35","v":0},0,0,{"$f":"H35","v":0},0,0,{"$f":"H35","v":0},0,null,null,null,null,null,null,null,null,null,null,null,null,{"$f":"L4","v":0},null,null,null,null,null,null,null,null,null,"1 Face","2 Faces","1 Face","2 Faces","UCV",null,"SE","F&L"]
[null,"Absorption",null,null,null,null,null,null,null,null,{"$f":"IF(ISTEXT(K17),\"\",(($D$36*K$10)+($E$36*K$11)+($F$36*K$12)+($G$36*K$13)+($H$36*K$14)+($I$36*K$15)+($J$36*K$16))/100)","v":""},{"$f":"IF(ISTEXT(L17),\"\",(($D$36*L$10)+($E$36*L$11)+($F$36*L$12)+($G$36*L$13)+($H$36*L$14)+($I$36*L$15)+($J$36*L$16))/100)","v":""},{"$f":"IF(ISTEXT(M17),\"\",(($D$36*M$10)+($E$36*M$11)+($F$36*M$12)+($G$36*M$13)+($H$36*M$14)+($I$36*M$15)+($J$36*M$16))/100)","v":""},null,null,null,null,null,null,null,0,{"$f":"I35","v":0},0,0,{"$f":"I35","v":0},0,0,{"$f":"I35","v":0},0,null,null,null,null,null,null,null,null,null,null,null,null,{"$f":"H5","v":0},null,null,null,null,null,null,null,null,null,"<100","<100",">100",">100","<100",">100"]
[null,"App. SpGr (Gsa)",null,{"$f":"IF(D36,1/(1/D35-D36/100),\"\")","v":""},{"$f":"IF(E36,1/(1/E35-E36/100),\"\")","v":""},"","","","","",{"$f":"IF(ISTEXT($K$17),\"\",W50)","v":""},{"$f":"IF(ISTEXT($K$17),\"\",Z50)","v":""},{"$f":"IF(ISTEXT($M$17),\"\",AC50)","v":""},"Min","Max",null,null,null,null,null,0,{"$f":"J35","v":0},0,0,{"$f":"J35","v":0},0,0,{"$f":"J35","v":0},0,null,null,null,null,null,null,null,null,null,null,null,null,{"$f":"INDEX($BF$37:$BF$42,MATCH(1,(AP35=$AX$37:$AX$42)*(AP36=$AY$37:$AY$42),0))","v":{"$error":"#N/A"}},{"$f":"INDEX($BG$37:$BG$42,MATCH(1,(AP35=$AX$37:$AX$42)*(AP36=$AY$37:$AY$42),0))","v":{"$error":"#N/A"}},{"$f":"INDEX($BD$37:$BD$42,MATCH(1,(AP35=$AX$37:$AX$42)*(AP36=$AY$37:$AY$42),0))","v":{"$error":"#N/A"}},{"$f":"INDEX($BE$37:$BE$42,MATCH(1,(AP35=$AX$37:$AX$42)*(AP36=$AY$37:$AY$42),0))","v":{"$error":"#N/A"}},{"$f":"INDEX($AZ$37:$AZ$42,MATCH(1,(AP35=$AX$37:$AX$42)*(AP36=$AY$37:$AY$42),0))","v":{"$error":"#N/A"}},{"$f":"INDEX($BA$37:$BA$42,MATCH(1,(AP35=$AX$37:$AX$42)*(AP36=$AY$37:$AY$42),0))","v":{"$error":"#N/A"}},{"$f":"INDEX($BB$37:$BB$42,MATCH(1,(AP35=$AX$37:$AX$42)*(AP36=$AY$37:$AY$42),0))","v":{"$error":"#N/A"}},{"$f":"INDEX($BC$37:$BC$42,MATCH(1,(AP35=$AX$37:$AX$42)*(AP36=$AY$37:$AY$42),0))","v":{"$error":"#N/A"}},{"$f":"$AP$35","v":0},"<.3",55,"-","-","-","-","-","Min 40","-"]
[null,"Sand Equivalency",null,null,null,null,null,null,null,null,{"$f":"IF(ISTEXT(K17),\"\",IF(K17>0,(($D38*K$10)+($E38*K$11)+($F38*K$12)+($G38*K$13)+($H38*K$14)+($I38*K$15)+($J38*K$16))/Q38,\"\"))","v":""},{"$f":"IF(ISTEXT(L17),\"\",IF(L17>0,(($D38*L$10)+($E38*L$11)+($F38*L$12)+($G38*L$13)+($H38*L$14)+($I38*L$15)+($J38*L$16))/R38,\"\"))","v":""},{"$f":"IF(ISTEXT(M17),\"\",IF(M17>0,(($D38*M$10)+($E38*M$11)+($F38*M$12)+($G38*M$13)+($H38*M$14)+($I38*M$15)+($J38*M$16))/S38,\"\"))","v":""},{"$f":"AP37","v":{"$error":"#N/A"}},null,null,{"$f":"IF($D38,K$10)+IF($E38,K$11)+IF($F38,K$12)+IF($G38,K$13)+IF($H38,K$14)+IF($I38,K$15)+IF($J38,K$16)","v":0},0,0,null,{"$f":"SUM(U31:U37)","v":0},null,{"$f":"SUM(W31:W37)","v":0},{"$f":"SUM(X31:X37)","v":0},null,{"$f":"SUM(Z31:Z37)","v":0},{"$f":"SUM(AA31:AA37)","v":0},null,{"$f":"SUM(AC31:AC37)","v":0},null,null,null,null,null,null,null,null,null,null,null,null,"UCV","F&L","SE <100","SE >100","1F <100","2F <100","1F >100","2F >100",{"$f":"$AP$35","v":0},".3 to <3",85,"-",50,"-","Min 40","Min 40","Min 40",10]
[null,"Flat & Elongated 3:1",null,null,null,null,null,null,null,null,{"$f":"IF(ISTEXT(K17),\"\",IF(K17>0,(($D39*K$10)+($E39*K$11)+($F39*K$12)+($G39*K$13)+($H39*K$14)+($I39*K$15)+($J39*K$16))/Q39,\"\"))","v":""},{"$f":"IF(ISTEXT(L17),\"\",IF(L17>0,(($D39*L$10)+($E39*L$11)+($F39*L$12)+($G39*L$13)+($H39*L$14)+($I39*L$15)+($J39*L$16))/R39,\"\"))","v":""},{"$f":"IF(ISTEXT(M17),\"\",IF(M17>0,(($D39*M$10)+($E39*M$11)+($F39*M$12)+($G39*M$13)+($H39*M$14)+($I39*M$15)+($J39*M$16))/S39,\"\"))","v":""},null,{"$f":"IF(OR(H4=\"SMA95\",H4=\"SMA125\"),20,\" \")","v":" "},null,0,0,0,null,null,null,{"$f":"U38/W38","v":{"$error":"#DIV/0!"}},null,null,{"$f":"X38/Z38","v":{"$error":"#DIV/0!"}},null,null,{"$f":"AA38/AC38","v":{"$error":"#DIV/0!"}},null,null,null,null,null,null,null,null,null,null,null,null,null,null,null,null,null,null,null,null,0,"3 to <10",95,80,60,"-","Min 45","Min 40","Min 45",10]
[null,"Flat & Elongated 5:1",null,null,null,null,null,null,null,null,{"$f":"IF(ISTEXT(K17),\"\",IF(K17>0,(($D40*K$10)+($E40*K$11)+($F40*K$12)+($G40*K$13)+($H40*K$14)+($I40*K$15)+($J40*K$16))/Q40,\"\"))","v":""},{"$f":"IF(ISTEXT(L17),\"\",IF(L17>0,(($D40*L$10)+($E40*L$11)+($F40*L$12)+($G40*L$13)+($H40*L$14)+($I40*L$15)+($J40*L$16))/R40,\"\"))","v":""},{"$f":"IF(ISTEXT(M17),\"\",IF(M17>0,(($D40*M$10)+($E40*M$11)+($F40*M$12)+($G40*M$13)+($H40*M$14)+($I40*M$15)+($J40*M$16))/S40,\"\"))","v":""},null,{"$f":"IF(OR(H4=\"SMA95\",H4=\"SMA125\"),5,AQ37)","v":{"$error":"#N/A"}},null,0,0,0,null,"Gsa Blend 1",null,null,"Gsa Blend 2",null,null,"Gsa Blend  3",null,null,null,null,null,null,null,null,null,null,null,null,null,null,null,null,null,null,null,null,null,null,0,"10 to <30",95,90,80,75,"Min 45","Min 40","Min 45",10]
[null,"Depth from Surface",null,null,null,null,null,null,null,null,null,null,null,"<100mm",">100mm",null,null,null,null,null,null,null,null,null,null,null,null,null,null,null,null,null,null,null,null,null,null,null,null,null,null,null,null,null,null,null,null,null,null,0,"3 to <30",95,90,80,75,"Min 45","Min 40","Min 45",10]
[null,"Uncompacted Voids",null,null,null,null,null,null,null,null,{"$f":"IF(ISTEXT(K17),\"\",IF(K17>0,(($D42*K$10)+($E42*K$11)+($F42*K$12)+($G42*K$13)+($H42*K$14)+($I42*K$15)+($J42*K$16))/Q42,\"\"))","v":""},{"$f":"IF(ISTEXT(L17),\"\",IF(L17>0,(($D42*L$10)+($E42*L$11)+($F42*L$12)+($G42*L$13)+($H42*L$14)+($I42*L$15)+($J42*L$16))/R42,\"\"))","v":""},{"$f":"IF(ISTEXT(M17),\"\",IF(M17>0,(($D42*M$10)+($E42*M$11)+($F42*M$12)+($G42*M$13)+($H42*M$14)+($I42*M$15)+($J42*M$16))/S42,\"\"))","v":""},{"$f":"AR37","v":{"$error":"#N/A"}},{"$f":"AS37","v":{"$error":"#N/A"}},null,0,0,0,null,{"$f":"K10","v":0},{"$f":"D37","v":""},{"$f":"IF(U42=0,0,U42/V42)","v":0},{"$f":"L10","v":0},{"$f":"D37","v":""},{"$f":"IF(X42=0,0,X42/Y42)","v":0},{"$f":"M10","v":0},{"$f":"D37","v":""},{"$f":"IF(AA42=0,0,AA42/AB42)","v":0},null,null,null,null,null,null,null,null,null,null,null,null,null,null,null,null,null,null,null,null,0,">30",95,90,95,90,"Min 45","Min 45","Min 50",10]
[null,"CA Angularity (1)",null,null,null,null,null,null,null,null,{"$f":"IF(ISTEXT(K17),\"\",IF(K17>0,(($D43*K$10)+($E43*K$11)+($F43*K$12)+($G43*K$13)+($H43*K$14)+($I43*K$15)+($J43*K$16))/Q43,\"\"))","v":""},{"$f":"IF(ISTEXT(L17),\"\",IF(L17>0,(($D43*L$10)+($E43*L$11)+($F43*L$12)+($G43*L$13)+($H43*L$14)+($I43*L$15)+($J43*L$16))/R43,\"\"))","v":""},{"$f":"IF(ISTEXT(M17),\"\",IF(M17>0,(($D43*M$10)+($E43*M$11)+($F43*M$12)+($G43*M$13)+($H43*M$14)+($I43*M$15)+($J43*M$16))/S43,\"\"))","v":""},{"$f":"AT37","v":{"$error":"#N/A"}},{"$f":"AV37","v":{"$error":"#N/A"}},null,0,0,0,null,0,{"$f":"E37","v":""},0,0,{"$f":"E37","v":""},0,0,{"$f":"E37","v":""},0]
[null,"CA Angularity (2)",null,null,null,null,null,null,null,null,{"$f":"IF(ISTEXT(K17),\"\",IF(K17>0,(($D44*K$10)+($E44*K$11)+($F44*K$12)+($G44*K$13)+($H44*K$14)+($I44*K$15)+($J44*K$16))/Q44,\"\"))","v":""},{"$f":"IF(ISTEXT(L17),\"\",IF(L17>0,(($D44*L$10)+($E44*L$11)+($F44*L$12)+($G44*L$13)+($H44*L$14)+($I44*L$15)+($J44*L$16))/R44,\"\"))","v":""},{"$f":"IF(ISTEXT(M17),\"\",IF(M17>0,(($D44*M$10)+($E44*M$11)+($F44*M$12)+($G44*M$13)+($H44*M$14)+($I44*M$15)+($J44*M$16))/S44,\"\"))","v":""},{"$f":"AU37","v":{"$error":"#N/A"}},{"$f":"AW37","v":{"$error":"#N/A"}},null,0,0,0,null,0,{"$f":"F37","v":""},0,0,{"$f":"F37","v":""},0,0,{"$f":"F37","v":""},0]
[null,null,null,null,null,null,null,null,null,null,null,null,null,null,null,null,null,null,null,null,0,{"$f":"G37","v":""},0,0,{"$f":"G37","v":""},0,0,{"$f":"G37","v":""},0]
[null,"Asphalt in the trial blends will be",null,null,null,null,null,null,null,null,null,null,null,null,null,null,null,null,null,null,0,{"$f":"H37","v":""},0,0,{"$f":"H37","v":""},0,0,{"$f":"H37","v":""},0]
[null,null,null,null,null,null,null,null,null,null,null,null,null,null,null,null,null,null,null,null,0,{"$f":"I37","v":""},0,0,{"$f":"I37","v":""},0,0,{"$f":"I37","v":""},0]
[null,null,null,null,null,null,null,null,null,null,null,null,null,null,null,null,null,null,null,null,0,{"$f":"J37","v":""},0,0,{"$f":"J37","v":""},0,0,{"$f":"J37","v":""},0]
[null,null,null,null,null,null,null,null,null,null,null,null,null,null,null,null,null,null,null,null,{"$f":"SUM(U42:U48)","v":0},null,{"$f":"SUM(W42:W48)","v":0},{"$f":"SUM(X42:X48)","v":0},null,{"$f":"SUM(Z42:Z48)","v":0},{"$f":"SUM(AA42:AA48)","v":0},null,{"$f":"SUM(AC42:AC48)","v":0}]
[null,null,null,null,null,null,null,null,null,null,null,null,null,null,null,null,null,null,null,null,null,null,{"$f":"U49/W49","v":{"$error":"#DIV/0!"}},null,null,{"$f":"X49/Z49","v":{"$error":"#DIV/0!"}},null,null,{"$f":"AA49/AC49","v":{"$error":"#DIV/0!"}}]
[]
[]
[]
[]
[]
[]
[null,null,null,null,null,null,null,null,null,null,null,null,null,null,null,null,null,null,null,null,null,null,null,0]
[null,null,null,null,null,null,null,null,null,null,null,null,null,null,null,null,null,null,null,null,null,null,null,0]
[null,null,null,null,null,null,null,null,null,null,null,null,null,null,null,null,null,null,null,null,null,null,null,0]
[null,null,null,null,null,null,null,null,null,null,null,null,null,null,null,null,null,null,null,null,null,null,null,0]
[null,null,null,null,null,null,null,null,null,null,null,null,null,null,null,null,null,null,null,null,null,null,null,0]
[null,null,null,null,null,null,null,null,null,null,null,null,null,null,null,null,null,null,null,null,null,null,null,0]
[null,null,null,null,null,null,null,null,null,null,null,null,null,null,null,null,null,null,null,null,null,null,null,0]
[null,null,null,null,null,null,null,null,null,null,null,null,null,null,null,null,null,null,null,null,null,null,null,0]
[null,null,null,null,null,null,null,null,null,null,null,null,null,null,null,null,null,null,null,null,null,null,null,0]
[null,null,null,null,null,null,null,null,null,null,null,null,null,null,null,null,null,null,null,null,null,null,0,0,0]

{"sheet":".45 Power","index":3,"n_rows":60,"n_cols":57,"rows_kept":60,"cut":false,"hidden":false,"merged":[[0,6,0,7],[1,4,1,5],[2,0,2,2],[17,0,17,1],[57,1,57,2],[57,7,57,8],[56,1,56,12],[59,1,59,2],[57,3,57,4],[58,3,58,4],[59,3,59,4],[57,5,57,6],[58,5,58,6],[59,5,59,6],[58,1,58,2],[59,7,59,8],[57,9,57,10],[58,9,58,10],[59,9,59,10],[57,11,57,12],[58,11,58,12],[59,11,59,12],[58,7,58,8]]}
[{"$f":"Setup!A2","v":"ESB-19"},null,null,null,null,null,null,null,null,null,null,null,null,null,null,null,null,null,null,null,null,null,null,null,null,null,null,{"$f":"Setup!E10","v":0}]
[null,null,null,null,"Control Points",null,"PCS",null,null,null,{"$f":"Setup!E9","v":0}]
["Size",null,null,".45 Power","Minimum","Maximum","Boundary","Boundary","Maximum Density Line",null,null,null,5.8150000000000004,{"$f":"IF($K$2=37.5,100,#N/A)","v":{"$error":"#N/A"}},null,null,"4.75mm",null,null,null,null,null,"9.5 mm",null,null,null,null,null,"12.5 mm",null,null,null,null,null,"19.0 mm",null,null,null,null,null,"25.0 mm",null,null,null,null,null,"37.5 mm",null,null,null,null,null,"6.33mm"]
["50mm","2\"",50,{"$f":"POWER(C4,0.45)","v":5.8148230317277987},{"$f":"IF($K$2=37.5,AU4,\" \")","v":" "},null,null,null,{"$f":"IF($K$2=37.5,AY4,IF($K$2=25,AS4,IF($K$2=19,AM4,IF($K$2=12.5,AG4,IF($K$2=9.5,AA4,IF($K$2=4.75,U4,IF($K$2=6.33,BE4)))))))","v":false},null,null,null,5.109,{"$f":"IF($K$2=25,100,#N/A)","v":{"$error":"#N/A"}},null,"2\"",null,null,null,null,null,"2\"",null,null,null,null,null,"2\"",null,null,null,null,null,"2\"",null,null,null,null,null,"2\"",null,null,null,null,null,"2\"",100,null,null,null,100,"2\""]
["37.5mm","1 1/2\"",37.5,{"$f":"POWER(C5,0.45)","v":5.1087431744234335},{"$f":"IF($K$2=37.5,AU5,IF($K$2=25,AO5,IF($K$2=19,AI5,IF($K$2=12.5,AC5,IF($K$2=9.5,W5,IF($K$2=4.75,Q5,IF($K$2=6.33,BA5)))))))","v":false},{"$f":"IF($K$2=37.5,AV5,IF($K$2=25,AP5,IF($K$2=19,AJ5,IF($K$2=12.5,AD5,IF($K$2=9.5,X5,IF($K$2=4.75,R5,IF($K$2=6.33,BB5)))))))","v":false},null,null,{"$f":"IF($K$2=37.5,AY5,IF($K$2=25,AS5,IF($K$2=19,AM5,IF($K$2=12.5,AG5,IF($K$2=9.5,AA5,IF($K$2=4.75,U5,IF($K$2=6.33,BE5)))))))","v":false},null,null,null,4.2569999999999997,{"$f":"IF($K$2=19,100,#N/A)","v":{"$error":"#N/A"}},null,"1 1/2\"",null,null,null,null,null,"1 1/2\"",null,null,null,null,null,"1 1/2\"",null,null,null,null,null,"1 1/2\"",null,null,null,null,null,"1 1/2\"",100,null,null,null,100,"1 1/2\"",90,100,null,null,null,"1 1/2\""]
["25.0mm","1\"",25,{"$f":"POWER(C6,0.45)","v":4.2566996126039234},{"$f":"IF($K$2=37.5,AU6,IF($K$2=25,AO6,IF($K$2=19,AI6,IF($K$2=12.5,AC6,IF($K$2=9.5,W6,IF($K$2=4.75,Q6,IF($K$2=6.33,BA6)))))))","v":false},{"$f":"IF($K$2=37.5,AV6,IF($K$2=25,AP6,IF($K$2=19,AJ6,IF($K$2=12.5,AD6,IF($K$2=9.5,X6,IF($K$2=4.75,R6,IF($K$2=6.33,BB6)))))))","v":false},null,null,false,null,null,null,3.762,{"$f":"IF($K$2=12.5,100,#N/A)","v":{"$error":"#N/A"}},null,"1\"",null,null,null,null,null,"1\"",null,null,null,null,null,"1\"",null,null,null,null,null,"1\"",100,null,null,null,100,"1\"",90,100,null,null,null,"1\"",null,89,null,null,null,"1\""]
["19.0mm","3/4\"",19,3.7621761023862978,{"$f":"IF($K$2=37.5,AU7,IF($K$2=25,AO7,IF($K$2=19,AI7,IF($K$2=12.5,AC7,IF($K$2=9.5,W7,IF($K$2=4.75,Q7,IF($K$2=6.33,BA7)))))))","v":false},false,null,null,false,null,null,null,3.1160000000000001,{"$f":"IF($K$2=9.5,100,IF($K$2=4.75,100,#N/A))","v":{"$error":"#N/A"}},null,"3/4\"",null,null,null,null,null,"3/4\"",null,null,null,null,null,"3/4\"",100,null,null,null,100,"3/4\"",90,100,null,null,null,"3/4\"",null,89,null,null,null,"3/4\"",null,null,null,null,null,"3/4\""]
["12.5mm","1/2\"",12.5,3.116086507375345,false,false,null,null,false,null,null,null,2.754,{"$f":"IF($K$2=6.33,100,#N/A)","v":{"$error":"#N/A"}},null,"1/2\"",100,null,null,null,100,"1/2\"",100,null,null,null,100,"1/2\"",90,{"$f":"IF($AB$1=\"SMA125\",99,100)","v":100},null,null,null,"1/2\"",null,89,null,null,null,"1/2\"",null,null,null,null,null,"1/2\"",null,null,null,null,null,"1/2\""]
["9.5mm","3/8\"",9.5,2.754074108566122,false,false,47,null,false,null,null,null,2.016,null,null,"3/8\"",95,100,null,null,null,"3/8\"",{"$f":"IF($AB$1=\"SMA95\",75,90)","v":90},{"$f":"IF($AB$1=\"SMA95\",95,100)","v":100},null,null,null,"3/8\"",{"$f":"IF($AB$1=\"SMA125\",70,\" \")","v":" "},{"$f":"IF($AB$1=\"SMA125\",85,89)","v":89},null,null,null,"3/8\"",null,null,null,null,null,"3/8\"",null,null,null,null,null,"3/8\"",null,null,47,null,null,"3/8\"",100,null,null,null,100]
["6.33mm","1/4",6.33,{"$f":"POWER(C10,0.45)","v":2.2942020817699724},false,false,null,null,false,null,null,null,2.294,null,null,"1/4",null,null,null,null,null,"1/4",null,null,null,null,null,"1/4",null,null,null,null,null,"1/4",null,null,null,null,null,"1/4",null,null,null,null,null,"1/4",null,null,null,null,null,"1/4",90,100]
["4.75mm","#4",4.75,2.0161002539629291,false,false,null,null,false,null,null,null,1.472,null,null,"#4",89,100,null,null,null,"#4",{"$f":"IF($AB$1=\"SMA95\",30,\" \")","v":" "},{"$f":"IF($AB$1=\"SMA95\",50,\" \")","v":" "},null,null,null,"#4",{"$f":"IF($AB$1=\"SMA125\",28,\" \")","v":" "},{"$f":"IF($AB$1=\"SMA125\",40,\" \")","v":" "},null,null,null,"#4",null,null,47,null,null,"#4",null,null,40,null,null,"#4",null,null,null,null,null,"#4",0,85]
["2.36mm","#8",2.36,1.4716698795820382,false,false,null,null,false,null,null,null,1.077,null,null,"#8",null,null,null,null,null,"#8",{"$f":"IF($AB$1=\"SMA95\",20,32)","v":32},{"$f":"IF($AB$1=\"SMA95\",30,67)","v":67},47,null,null,"#8",{"$f":"IF($AB$1=\"SMA125\",18,28)","v":28},{"$f":"IF($AB$1=\"SMA125\",30,58)","v":58},39,null,null,"#8",23,49,null,null,null,"#8",19,45,null,null,null,"#8",15,41,null,null,null,"#8",37,55]
["1.18mm","#16",1.18,1.0773254099250416,false,false,null,null,false,null,null,null,0.79500000000000004,null,null,"#16",30,60,null,null,null,"#16",null,null,null,null,null,"#16",null,null,null,null,null,"#16",null,null,null,null,null,"#16",null,null,null,null,null,"#16",null,null,null,null,null,"#16"]
["600µm","#30",0.6,0.79463568224020453,false,false,null,null,false,null,null,null,0.58199999999999996,null,null,"#30",null,null,null,null,null,"#30",null,null,null,null,null,"#30",null,null,null,null,null,"#30",null,null,null,null,null,"#30",null,null,null,null,null,"#30",null,null,null,null,null,"#30"]
["300µm","#50",0.3,0.58170736792793831,false,false,null,null,false,null,null,null,0.42599999999999999,null,null,"#50",null,null,null,null,null,"#50",null,null,null,null,null,"#50",null,null,null,null,null,"#50",null,null,null,null,null,"#50",null,null,null,null,null,"#50",null,null,null,null,null,"#50",8,25]
["150µm","#100",0.15,0.42583471830473674,false,false,null,null,false,null,null,null,0.312,null,null,"#100",null,null,null,null,null,"#100",null,null,null,null,null,"#100",null,null,null,null,null,"#100",null,null,null,null,null,"#100",null,null,null,null,null,"#100",null,null,null,null,null,"#100"]
["75µm","#200",7.4999999999999997E-2,{"$f":"POWER(C17,0.45)","v":0.31172925995349998},false,false,null,null,false,null,null,null,0,0,null,"#200",6,12,null,null,null,"#200",{"$f":"IF($AB$1=\"SMA95\",8,2)","v":2},{"$f":"IF($AB$1=\"SMA95\",11,10)","v":10},null,null,null,"#200",{"$f":"IF($AB$1=\"SMA125\",8,2)","v":2},{"$f":"IF($AB$1=\"SMA125\",11,10)","v":10},null,null,null,"#200",2,8,null,null,null,"#200",1,7,null,null,null,"#200",0,6,null,null,null,"#200",3,10]
["Pan",null,0,0,null,null,null,null,false,null,null,null,null,null,null,null,null,null,null,null,0,null,null,null,null,null,0,null,null,null,null,null,0,null,null,null,null,null,0,null,null,null,null,null,0,null,null,null,null,null,0]
[]
[]
[]
[null,null,null,null,null,null,null,null,null,null,null,null,null,null,null,null,null,null,null,null,null,null,null,"Blend 1","Blend 2","Blend 3"]
[null,null,null,null,null,null,null,null,null,null,null,null,null,null,null,null,null,null,null,null,null,null,1.5,{"$f":"IF(ISBLANK('Agg Blends'!K21),#N/A,'Agg Blends'!K21)","v":{"$error":"#N/A"}},{"$f":"IF(ISBLANK('Agg Blends'!L21),#N/A,'Agg Blends'!L21)","v":{"$error":"#N/A"}},{"$f":"IF(ISBLANK('Agg Blends'!M21),#N/A,'Agg Blends'!M21)","v":{"$error":"#N/A"}}]
[null,null,null,null,null,null,null,null,null,null,null,null,null,null,null,null,null,null,null,null,null,null,1,{"$f":"IF(ISBLANK('Agg Blends'!K22),#N/A,'Agg Blends'!K22)","v":{"$error":"#N/A"}},{"$f":"IF(ISBLANK('Agg Blends'!L22),#N/A,'Agg Blends'!L22)","v":{"$error":"#N/A"}},{"$f":"IF(ISBLANK('Agg Blends'!M22),#N/A,'Agg Blends'!M22)","v":{"$error":"#N/A"}}]
[null,null,null,null,null,null,null,null,null,null,null,null,null,null,null,null,null,null,null,null,null,null,0.75,{"$f":"IF(ISBLANK('Agg Blends'!K23),#N/A,'Agg Blends'!K23)","v":{"$error":"#N/A"}},{"$f":"IF(ISBLANK('Agg Blends'!L23),#N/A,'Agg Blends'!L23)","v":{"$error":"#N/A"}},{"$f":"IF(ISBLANK('Agg Blends'!M23),#N/A,'Agg Blends'!M23)","v":{"$error":"#N/A"}}]
[null,null,null,null,null,null,null,null,null,null,null,null,null,null,null,null,null,null,null,null,null,null,0.5,{"$f":"IF(ISBLANK('Agg Blends'!K24),#N/A,'Agg Blends'!K24)","v":{"$error":"#N/A"}},{"$f":"IF(ISBLANK('Agg Blends'!L24),#N/A,'Agg Blends'!L24)","v":{"$error":"#N/A"}},{"$f":"IF(ISBLANK('Agg Blends'!M24),#N/A,'Agg Blends'!M24)","v":{"$error":"#N/A"}}]
[null,null,null,null,null,null,null,null,null,null,null,null,null,null,null,null,null,null,null,null,null,null,0.375,{"$f":"'Agg Blends'!K25","v":0},{"$f":"'Agg Blends'!L25","v":0},{"$f":"'Agg Blends'!M25","v":0}]
[null,null,null,null,null,null,null,null,null,null,null,null,null,null,null,null,null,null,null,null,null,null,0.25,{"$f":"'Agg Blends'!K26","v":0},{"$f":"'Agg Blends'!L26","v":0},{"$f":"'Agg Blends'!M26","v":0}]
[null,null,null,null,null,null,null,null,null,null,null,null,null,null,null,null,null,null,null,null,null,null,4,{"$f":"'Agg Blends'!K27","v":0},{"$f":"'Agg Blends'!L27","v":0},{"$f":"'Agg Blends'!M27","v":0}]
[null,null,null,null,null,null,null,null,null,null,null,null,null,null,null,null,null,null,null,null,null,null,8,{"$f":"'Agg Blends'!K28","v":0},{"$f":"'Agg Blends'!L28","v":0},{"$f":"'Agg Blends'!M28","v":0}]
[null,null,null,null,null,null,null,null,null,null,null,null,null,null,null,null,null,null,null,null,null,null,16,{"$f":"'Agg Blends'!K29","v":0},{"$f":"'Agg Blends'!L29","v":0},{"$f":"'Agg Blends'!M29","v":0}]
[null,null,null,null,null,null,null,null,null,null,null,null,null,null,null,null,null,null,null,null,null,null,30,{"$f":"'Agg Blends'!K30","v":0},{"$f":"'Agg Blends'!L30","v":0},{"$f":"'Agg Blends'!M30","v":0}]
[null,null,null,null,null,null,null,null,null,null,null,null,null,null,null,null,null,null,null,null,null,null,50,{"$f":"'Agg Blends'!K31","v":0},{"$f":"'Agg Blends'!L31","v":0},{"$f":"'Agg Blends'!M31","v":0}]
[null,null,null,null,null,null,null,null,null,null,null,null,null,null,null,null,null,null,null,null,null,null,100,{"$f":"'Agg Blends'!K32","v":" "},{"$f":"'Agg Blends'!L32","v":" "},{"$f":"'Agg Blends'!M32","v":" "}]
[null,null,null,null,null,null,null,null,null,null,null,null,null,null,null,null,null,null,null,null,null,null,200,{"$f":"'Agg Blends'!K33","v":0},{"$f":"'Agg Blends'!L33","v":0},{"$f":"'Agg Blends'!M33","v":0}]
[]
[]
[]
[]
[]
[]
[]
[]
[]
[]
[]
[]
[]
[]
[]
[]
[]
[]
[]
[]
[]
[null,".45 Power Chart"]
[null,"Producer:",null,{"$f":"Setup!E7","v":0},null,"Material Class:",null,{"$f":"Setup!E10","v":0},null,"Nominal Size:",null,{"$f":"Setup!E9","v":0}]
[null,"Designed By:",null,{"$f":"Setup!E8","v":0},null,"Esals:",null,{"$f":"Setup!E12","v":0},null,"SRL:",null,{"$f":"Setup!E11","v":0}]
[null,"Date:",null,{"$f":"Setup!E6","v":"00:00:00"},null,"Rap:",null,{"$f":"Setup!E17","v":0},null,"PG Grade:",null,{"$f":"Setup!E14","v":0}]

{"sheet":"Gmm","index":4,"n_rows":37,"n_cols":22,"rows_kept":37,"cut":false,"hidden":false,"merged":[[34,1,34,4],[34,9,34,10],[34,15,34,16],[34,21,34,22],[4,5,4,8],[3,9,3,12],[4,9,4,12],[5,9,5,12],[5,5,5,8],[31,1,31,4],[31,9,31,10],[31,15,31,16],[31,21,31,22],[32,1,32,4],[32,9,32,10],[32,15,32,16],[32,21,32,22],[33,1,33,4],[33,9,33,10],[33,15,33,16],[33,21,33,22],[27,1,27,4],[27,9,27,10],[27,15,27,16],[27,21,27,22],[28,1,28,4],[28,9,28,10],[28,15,28,16],[28,21,28,22],[30,1,30,22],[24,1,24,22],[25,1,25,4],[25,9,25,10],[25,15,25,16],[25,21,25,22],[26,1,26,4],[26,9,26,10],[26,15,26,16],[26,21,26,22],[20,1,20,4],[20,9,20,10],[20,15,20,16],[20,21,20,22],[21,1,21,4],[21,9,21,10],[21,15,21,16],[21,21,21,22],[22,1,22,4],[22,9,22,10],[22,15,22,16],[22,21,22,22],[15,9,15,10],[15,15,15,16],[15,21,15,22],[17,1,17,22],[18,1,18,4],[18,9,18,10],[18,15,18,16],[18,21,18,22],[19,1,19,4],[19,9,19,10],[19,15,19,16],[19,21,19,22],[13,21,13,22],[14,1,14,4],[14,5,14,6],[14,7,14,8],[14,9,14,10],[14,11,14,12],[14,13,14,14],[14,15,14,16],[14,17,14,18],[14,19,14,20],[14,21,14,22],[13,1,13,4],[13,5,13,6],[13,7,13,8],[13,9,13,10],[13,11,13,12],[13,13,13,14],[13,15,13,16],[13,17,13,18],[13,19,13,20],[11,21,11,22],[12,1,12,4],[12,5,12,6],[12,7,12,8],[12,9,12,10],[12,11,12,12],[12,13,12,14],[12,15,12,16],[12,17,12,18],[12,19,12,20],[12,21,12,22],[11,1,11,4],[11,5,11,6],[11,7,11,8],[11,9,11,10],[11,11,11,12],[11,13,11,14],[11,15,11,16],[11,17,11,18],[11,19,11,20],[10,9,10,10],[10,11,10,12],[10,13,10,14],[10,15,10,16],[10,17,10,18],[10,19,10,20],[10,21,10,22],[9,1,9,4],[9,5,9,6],[9,7,9,8],[9,9,9,10],[9,11,9,12],[9,13,9,14],[9,15,9,16],[9,17,9,18],[9,19,9,20],[3,13,3,16],[36,9,36,16],[0,1,0,2],[2,1,2,22],[3,2,3,4],[3,5,3,8],[3,17,3,19],[3,20,3,21],[4,2,4,4],[4,18,4,19],[4,20,4,21],[5,2,5,4],[5,17,5,19],[5,20,5,21],[4,13,4,15],[5,13,5,15],[7,1,7,22],[8,5,8,10],[8,11,8,16],[8,17,8,22],[9,21,9,22],[10,1,10,4],[10,5,10,6],[10,7,10,8]]}
[null,{"$f":"Setup!A2","v":"ESB-19"}]
[]
[null,"Maximum Specific Gravity anf Effective Asphalt"]
[null,null,"Producer;",null,null,{"$f":"Setup!E7","v":0},null,null,null,"Material Class:",null,null,null,{"$f":"Setup!E10","v":0},null,null,null,"Nominal Size:",null,null,{"$f":"Setup!E9","v":0}]
[null,null,"Designed By:",null,null,{"$f":"Setup!E8","v":0},null,null,null,"Esals:",null,null,null,{"$f":"Setup!E12","v":0},null,null,null,null,"SRL:",null,{"$f":"Setup!E11","v":0}]
[null,null,"Date:",null,null,{"$f":"Setup!E6","v":"00:00:00"},null,null,null,"Rap:",null,null,null,{"$f":"Setup!E17","v":0},null,null,null,"PG Grade:",null,null,{"$f":"Setup!E14","v":0}]
[]
[null,"Maximum Specific Gravity (Gmm)"]
[null,null,null,null,null,"Blend 1",null,null,null,null,null,"Blend 2",null,null,null,null,null,"Blend 3"]
[null,"Sample No"]
[null,"Dry Wt. of Sample"]
[null,{"$f":"IF(Setup!$E$19=\"Suspension\",\"Mass of Pyc in Water\",\"Mass of Pyc + Water\")","v":"Mass of Pyc + Water"},null,null,null,{"$f":"IF(F11,Setup!$F$20,\"\")","v":""},null,{"$f":"IF(H11,Setup!$F$20,\"\")","v":""},null,{"$f":"IF(J11,Setup!$F$20,\"\")","v":""},null,{"$f":"IF(L11,Setup!$F$20,\"\")","v":""},null,{"$f":"IF(N11,Setup!$F$20,\"\")","v":""},null,{"$f":"IF(P11,Setup!$F$20,\"\")","v":""},null,{"$f":"IF(R11,Setup!$F$20,\"\")","v":""},null,{"$f":"IF(T11,Setup!$F$20,\"\")","v":""},null,{"$f":"IF(V11,Setup!$F$20,\"\")","v":""}]
[null,{"$f":"IF(Setup!F19=\"Suspension\",\"Mass samp+Pyc in H2O\",\"Mass Pyc + Mix + Water\")","v":"Mass samp+Pyc in H2O"}]
[null,"Vol Voidless Mix",null,null,null,{"$f":"IF(F13,ROUND(F11+F12-F13,1),\" \")","v":" "},null,{"$f":"IF(H13,ROUND(H11+H12-H13,1),\" \")","v":" "},null,{"$f":"IF(J13,ROUND(J11+J12-J13,1),\" \")","v":" "},null,{"$f":"IF(L13,ROUND(L11+L12-L13,1),\" \")","v":" "},null,{"$f":"IF(N13,ROUND(N11+N12-N13,1),\" \")","v":" "},null,{"$f":"IF(P13,ROUND(P11+P12-P13,1),\" \")","v":" "},null,{"$f":"IF(R13,ROUND(R11+R12-R13,1),\" \")","v":" "},null,{"$f":"IF(T13,ROUND(T11+T12-T13,1),\" \")","v":" "},null,{"$f":"IF(V13,ROUND(V11+V12-V13,1),\" \")","v":" "}]
[null,"Max Sp Gr of Mix",null,null,null,{"$f":"IF(F13,ROUND(F11/F14,3),\" \")","v":" "},null,{"$f":"IF(H13,ROUND(H11/H14,3),\" \")","v":" "},null,{"$f":"IF(J13,ROUND(J11/J14,3),\" \")","v":" "},null,{"$f":"IF(L13,ROUND(L11/L14,3),\" \")","v":" "},null,{"$f":"IF(N13,ROUND(N11/N14,3),\" \")","v":" "},null,{"$f":"IF(P13,ROUND(P11/P14,3),\" \")","v":" "},null,{"$f":"IF(R13,ROUND(R11/R14,3),\" \")","v":" "},null,{"$f":"IF(T13,ROUND(T11/T14,3),\" \")","v":" "},null,{"$f":"IF(V13,ROUND(V11/V14,3),\" \")","v":" "}]
[null,null,null,null,null,null,null,null,null,{"$f":"IF(F13,ROUND(AVERAGE(F15:J15),3),\" \")","v":" "},null,null,null,null,null,{"$f":"IF(L13,ROUND(AVERAGE(L15:P15),3),\" \")","v":" "},null,null,null,null,null,{"$f":"IF(R13,ROUND(AVERAGE(R15:V15),3),\" \")","v":" "}]
[]
[null,"Effective Specific Gravity of Aggregate (Gse)"]
[null,"Max Sp Gr of Mix",null,null,null,null,null,null,null,{"$f":"J16","v":" "},null,null,null,null,null,{"$f":"P16","v":" "},null,null,null,null,null,{"$f":"V16","v":" "}]
[null,"% AC in Test Mix",null,null,null,null,null,null,null,{"$f":"IF(F13,'Agg Blends'!K46,\"\")","v":""},null,null,null,null,null,{"$f":"IF(L13,'Agg Blends'!L46,\"\")","v":""},null,null,null,null,null,{"$f":"IF(R13,'Agg Blends'!M46,\"\")","v":""}]
[null,"Gb of Binder",null,null,null,null,null,null,null,{"$f":"IF($F$13,Setup!$E$15,\"\")","v":""},null,null,null,null,null,{"$f":"IF($F$13,Setup!$E$15,\"\")","v":""},null,null,null,null,null,{"$f":"IF($F$13,Setup!$E$15,\"\")","v":""}]
[null,"% of Total Mixture",null,null,null,null,null,null,null,{"$f":"IF(F11,100,\" \")","v":" "},null,null,null,null,null,{"$f":"IF(L11,100,\" \")","v":" "},null,null,null,null,null,{"$f":"IF(R11,100,\" \")","v":" "}]
[null,"Eff. Gravity of Agg",null,null,null,null,null,null,null,{"$f":"IF(F11,(J22-J20)/(J22/J16-J20/J21),\" \")","v":" "},null,null,null,null,null,{"$f":"IF(L11,(P22-P20)/(P22/P16-P20/P21),\" \")","v":" "},null,null,null,null,null,{"$f":"IF(R11,(V22-V20)/(V22/V16-V20/V21),\" \")","v":" "}]
[]
[null,"Asphalt Absorption of Mix (Pba)"]
[null,"Eff. Gravity of Agg",null,null,null,null,null,null,null,{"$f":"J23","v":" "},null,null,null,null,null,{"$f":"P23","v":" "},null,null,null,null,null,{"$f":"V23","v":" "}]
[null,"Bulk Gravity of Agg",null,null,null,null,null,null,null,{"$f":"IF(F13,'Agg Blends'!K35,\"\")","v":""},null,null,null,null,null,{"$f":"IF(L13,'Agg Blends'!L35,\"\")","v":""},null,null,null,null,null,{"$f":"IF(R13,'Agg Blends'!M35,\"\")","v":""}]
[null,"Gb of Binder",null,null,null,null,null,null,null,{"$f":"IF($F$13,Setup!$E$15,\"\")","v":""},null,null,null,null,null,{"$f":"IF($F$13,Setup!$E$15,\"\")","v":""},null,null,null,null,null,{"$f":"IF($F$13,Setup!$E$15,\"\")","v":""}]
[null,"Absorbed Asphalt",null,null,null,null,null,null,null,{"$f":"IF(F11,100*((J26-J27)/(J27*J26))*J28,\" \")","v":" "},null,null,null,null,null,{"$f":"IF(L11,100*((P26-P27)/(P27*P26))*P28,\" \")","v":" "},null,null,null,null,null,{"$f":"IF(R11,100*((V26-V27)/(V27*V26))*V28,\" \")","v":" "}]
[]
[null,"Effective Asphalt Content in mix (Pbe)"]
[null,"Absorber Asphalt",null,null,null,null,null,null,null,{"$f":"J29","v":" "},null,null,null,null,null,{"$f":"P29","v":" "},null,null,null,null,null,{"$f":"V29","v":" "}]
[null,"% AC in Test Mix",null,null,null,null,null,null,null,{"$f":"J20","v":""},null,null,null,null,null,{"$f":"P20","v":""},null,null,null,null,null,{"$f":"V20","v":""}]
[null,"% Agg in Test Mix",null,null,null,null,null,null,null,{"$f":"IF(F11,100-J20,\" \")","v":" "},null,null,null,null,null,{"$f":"IF(L11,100-P20,\" \")","v":" "},null,null,null,null,null,{"$f":"IF(R11,100-V20,\" \")","v":" "}]
[null,"Effective Asphalt",null,null,null,null,null,null,null,{"$f":"IF(F11,ROUND(J33-(J29/100)*J34,1),\" \")","v":" "},null,null,null,null,null,{"$f":"IF(L11,ROUND(P33-(P29/100)*P34,1),\" \")","v":" "},null,null,null,null,null,{"$f":"IF(R11,ROUND(V33-(V29/100)*V34,1),\" \")","v":" "}]
[]
[null,null,null,null,null,null,null,null,null,{"$f":"Setup!$F$19&\" Method of Testing\"","v":"Suspension Method of Testing"}]

{"sheet":"Trial Blends","index":5,"n_rows":45,"n_cols":33,"rows_kept":45,"cut":false,"hidden":false,"merged":[[41,6,41,12],[42,6,42,12],[24,9,24,10],[37,13,37,14],[37,15,37,16],[37,17,37,18],[42,13,42,14],[36,13,36,14],[36,15,36,16],[36,17,36,18],[32,13,32,14],[32,15,32,16],[32,17,32,18],[24,11,24,12],[5,9,5,14],[5,15,5,17],[41,13,41,14],[38,13,38,14],[38,15,38,16],[38,17,38,18],[39,13,39,14],[39,15,39,16],[39,17,39,18],[33,13,33,14],[33,15,33,16],[33,17,33,18],[34,13,34,14],[34,15,34,16],[34,17,34,18],[35,13,35,14],[35,15,35,16],[35,17,35,18],[30,13,30,14],[30,15,30,16],[30,17,30,18],[31,13,31,14],[31,15,31,16],[31,17,31,18],[25,21,25,22],[25,23,25,24],[26,19,26,20],[26,21,26,22],[26,23,26,24],[28,6,28,18],[29,13,29,14],[29,15,29,16],[29,17,29,18],[25,5,25,8],[25,9,25,10],[25,11,25,12],[25,1,25,2],[25,3,25,4],[25,13,25,14],[25,15,25,16],[25,17,25,18],[25,19,25,20],[22,21,23,22],[22,23,23,24],[24,1,24,2],[24,3,24,4],[24,13,24,14],[24,15,24,16],[24,17,24,18],[24,19,24,20],[24,21,24,22],[24,23,24,24],[22,1,23,2],[22,3,23,4],[22,13,23,14],[22,15,23,16],[22,17,23,18],[22,5,23,8],[24,5,24,8],[22,19,23,20],[18,21,18,22],[18,23,18,24],[19,19,19,20],[19,21,19,22],[19,23,19,24],[21,15,21,22],[21,23,21,24],[18,1,18,2],[18,3,18,4],[18,13,18,14],[18,15,18,16],[18,17,18,18],[18,19,18,20],[18,5,18,8],[21,11,21,14],[18,9,18,10],[18,11,18,12],[15,21,16,22],[15,23,16,24],[17,1,17,2],[17,3,17,4],[17,13,17,14],[17,15,17,16],[17,17,17,18],[17,19,17,20],[17,21,17,22],[17,23,17,24],[15,1,16,2],[15,3,16,4],[15,13,16,14],[15,15,16,16],[15,17,16,18],[15,19,16,20],[15,5,16,8],[17,5,17,8],[17,9,17,10],[15,11,16,12],[17,11,17,12],[11,23,11,24],[12,19,12,20],[12,21,12,22],[12,23,12,24],[14,15,14,22],[14,23,14,24],[11,1,11,2],[11,3,11,4],[11,13,11,14],[11,15,11,16],[11,17,11,18],[11,19,11,20],[11,9,11,10],[11,11,11,12],[11,5,11,8],[12,5,13,8],[14,11,14,14],[7,11,7,14],[15,9,16,10],[8,23,9,24],[10,1,10,2],[10,3,10,4],[10,13,10,14],[10,15,10,16],[10,17,10,18],[10,19,10,20],[10,21,10,22],[10,23,10,24],[8,1,9,2],[8,3,9,4],[8,13,9,14],[8,15,9,16],[8,17,9,18],[8,19,9,20],[8,5,9,8],[10,5,10,8],[10,9,10,10],[8,9,9,10],[8,11,9,12],[10,11,10,12],[11,21,11,22],[3,15,3,18],[22,9,23,10],[22,11,23,12],[44,0,44,25],[0,1,0,2],[2,1,2,24],[3,2,3,4],[3,5,3,8],[3,19,3,21],[3,22,3,23],[3,9,3,14],[4,2,4,4],[4,20,4,21],[4,22,4,23],[5,2,5,4],[5,5,5,7],[5,19,5,21],[5,22,5,23],[4,5,4,8],[4,9,4,14],[4,15,4,17],[7,15,7,22],[7,23,7,24],[8,21,9,22]]}
[null,{"$f":"Setup!A2","v":"ESB-19"},null,null,null,null,null,null,null,null,null,null,null,null,null,null,null,null,null,null,null,null,null,null,null,null,null,null,null,null,null,null,{"$f":"Setup!F24","v":0}]
[null,null,null,null,null,null,null,null,null,null,null,null,null,null,null,null,null,null,null,null,null,null,null,null,null,null,null,null,null,null,null,null,{"$f":"Setup!F23","v":"Suspension"}]
[null,"INITIAL TRIAL BLEND RESULTS",null,null,null,null,null,null,null,null,null,null,null,null,null,null,null,null,null,null,null,null,null,null,null,null,null,null,null,null,null,null,1]
[null,null,"Producer;",null,null,{"$f":"Setup!E7","v":0},null,null,null,"Material Class:",null,null,null,null,null,{"$f":"Setup!E10","v":0},null,null,null,"Nominal Size:",null,null,{"$f":"Setup!E9","v":0},null,null,null,null,null,null,null,null,null,2]
[null,null,"Designed By:",null,null,{"$f":"Setup!E8","v":0},null,null,null,"Esals:",null,null,null,null,null,{"$f":"Setup!E12","v":0},null,null,null,null,"SRL:",null,{"$f":"Setup!E11","v":0},null,null,null,null,null,null,null,null,null,3]
[null,null,"Date:",null,null,{"$f":"Setup!E6","v":"00:00:00"},null,null,null,"Rap:",null,null,null,null,null,{"$f":"Setup!E17","v":0},null,null,null,"PG Grade:",null,null,{"$f":"Setup!E14","v":0}]
[]
[null,"Blend 1",null,null,null,null,null,null,null,null,null,"Samp Ht.",null,null,null,"Maximum Theoretical Gravity (Gmm) =",null,null,null,null,null,null,null,{"$f":"Gmm!J16","v":" "}]
[null,null,null,"Dry Weight",null,{"$f":"IF(Setup!$F$23=\"Suspension\",\"Mass Spec. in H2O\",\"Mass Pyc + Specimen + Water\")","v":"Mass Spec. in H2O"},null,null,null,"SSD Weight",null,"Height @ Nini",null,"Height @ Ndes",null,"Gmb",null,"% Gmm",null,"Voids",null,"VMA",null,"VFA"]
[null,null,null,null,null,{"$f":"IF(Setup!I16=\"Suspension\",\"Mass samp+Pyc in H2O\",\"Mass Pyc + Mix + Water\")","v":"Mass Pyc + Mix + Water"}]
[null,"Spec. 1",null,null,null,null,null,null,null,null,null,null,null,null,null,{"$f":"IF($AG$2=\"Suspension\",ROUND(D11/(J11-F11),3),IF($AG$2=\"Volumeter\",ROUND(D11/(J11-(F11-$AG$1)),3),\" \"))","v":{"$error":"#DIV/0!"}},null,{"$f":"IF(J11,ROUND(P11/X8*100,1),\"\")","v":""},null,{"$f":"IF(J11,ROUND(100*(1-(P11/$X$8)),1),\"\")","v":""},null,{"$f":"IF(J11,ROUND(100-(P11/'Agg Blends'!K35)*Gmm!J34,1),\"\")","v":""},null,{"$f":"IF(J11,100*(V11-T11)/V11,\"\")","v":""}]
[null,"Spec. 2",null,null,null,null,null,null,null,null,null,null,null,null,null,{"$f":"IF($AG$2=\"Suspension\",ROUND(D12/(J12-F12),3),IF($AG$2=\"Volumeter\",ROUND(D12/(J12-(F12-$AG$1)),3),\" \"))","v":{"$error":"#DIV/0!"}},null,{"$f":"IF(J12,ROUND(P12/X8*100,1),\"\")","v":""},null,{"$f":"IF(J12,ROUND(100*(1-(P12/$X$8)),1),\"\")","v":""},null,{"$f":"IF(J12,ROUND(100-(P12/'Agg Blends'!K35)*Gmm!J34,1),\"\")","v":""},null,{"$f":"IF(J12,100*(V12-T12)/V12,\"\")","v":""}]
[null,null,null,null,null,null,null,null,null,null,null,null,null,null,null,null,null,null,null,{"$f":"IF(J11,ROUND(AVERAGE(T11:T12),2),\"\")","v":""},null,{"$f":"IF(J11,ROUND(AVERAGE(V11:V12),2),\"\")","v":""},null,{"$f":"IF(J11,ROUND(AVERAGE(X11:X12),2),\"\")","v":""}]
[]
[null,"Blend 2",null,null,null,null,null,null,null,null,null,"Samp Ht.",null,null,null,"Maximum Theoretical Gravity (Gmm) =",null,null,null,null,null,null,null,{"$f":"Gmm!P16","v":" "}]
[null,null,null,"Dry Weight",null,{"$f":"IF(Setup!$F$23=\"Suspension\",\"Mass Spec. in H2O\",\"Mass Pyc + Specimen + Water\")","v":"Mass Spec. in H2O"},null,null,null,"SSD Weight",null,"Height @ Nini",null,"Height @ Ndes",null,"Gmb",null,"% Gmm",null,"Voids",null,"VMA",null,"VFA"]
[null,null,null,null,null,{"$f":"IF(Setup!I22=\"Suspension\",\"Mass samp+Pyc in H2O\",\"Mass Pyc + Mix + Water\")","v":"Mass Pyc + Mix + Water"}]
[null,"Spec. 1",null,null,null,null,null,null,null,null,null,null,null,null,null,{"$f":"IF($AG$2=\"Suspension\",ROUND(D18/(J18-F18),3),IF($AG$2=\"Volumeter\",ROUND(D18/(J18-(F18-$AG$1)),3),\" \"))","v":{"$error":"#DIV/0!"}},null,{"$f":"IF(J18,ROUND(P18/X15*100,1),\"\")","v":""},null,{"$f":"IF(J18,ROUND(100*(1-(P18/$X$15)),1),\"\")","v":""},null,{"$f":"IF(J18,ROUND(100-(P18/'Agg Blends'!L35)*Gmm!P34,1),\"\")","v":""},null,{"$f":"IF(J18,100*(V18-T18)/V18,\"\")","v":""}]
[null,"Spec. 2",null,null,null,null,null,null,null,null,null,null,null,null,null,{"$f":"IF($AG$2=\"Suspension\",ROUND(D19/(J19-F19),3),IF($AG$2=\"Volumeter\",ROUND(D19/(J19-(F19-$AG$1)),3),\" \"))","v":{"$error":"#DIV/0!"}},null,{"$f":"IF(J19,ROUND(P19/X15*100,1),\"\")","v":""},null,{"$f":"IF(J19,ROUND(100*(1-(P19/$X$15)),1),\"\")","v":""},null,{"$f":"IF(J19,ROUND(100-(P19/'Agg Blends'!L35)*Gmm!P34,1),\"\")","v":""},null,{"$f":"IF(J19,100*(V19-T19)/V19,\"\")","v":""}]
[null,null,null,null,null,null,null,null,null,null,null,null,null,null,null,null,null,null,null,{"$f":"IF(J18,ROUND(AVERAGE(T18:T19),2),\"\")","v":""},null,{"$f":"IF(J18,ROUND(AVERAGE(V18:V19),2),\"\")","v":""},null,{"$f":"IF(J18,ROUND(AVERAGE(X18:X19),2),\"\")","v":""}]
[]
[null,"Blend 3",null,null,null,null,null,null,null,null,null,"Samp Ht.",null,null,null,"Maximum Theoretical Gravity (Gmm) =",null,null,null,null,null,null,null,{"$f":"Gmm!V16","v":" "}]
[null,null,null,"Dry Weight",null,{"$f":"IF(Setup!$F$23=\"Suspension\",\"Mass Spec. in H2O\",\"Mass Pyc + Specimen + Water\")","v":"Mass Spec. in H2O"},null,null,null,"SSD Weight",null,"Height @ Nini",null,"Height @ Ndes",null,"Gmb",null,"% Gmm",null,"Voids",null,"VMA",null,"VFA"]
[null,null,null,null,null,{"$f":"IF(Setup!I29=\"Suspension\",\"Mass samp+Pyc in H2O\",\"Mass Pyc + Mix + Water\")","v":"Mass Pyc + Mix + Water"}]
[null,"Spec. 1",null,null,null,null,null,null,null,null,null,null,null,null,null,{"$f":"IF($AG$2=\"Suspension\",ROUND(D25/(J25-F25),3),IF($AG$2=\"Volumeter\",ROUND(D25/(J25-(F25-$AG$1)),3),\" \"))","v":{"$error":"#DIV/0!"}},null,{"$f":"IF(J25,ROUND(P25/X22*100,1),\"\")","v":""},null,{"$f":"IF(J25,ROUND(100*(1-(P25/$X$22)),1),\"\")","v":""},null,{"$f":"IF(J25,ROUND(100-(P25/'Agg Blends'!M35)*Gmm!V34,1),\"\")","v":""},null,{"$f":"IF(J25,100*(V25-T25)/V25,\"\")","v":""}]
[null,"Spec. 2",null,null,null,null,null,null,null,null,null,null,null,null,null,{"$f":"IF($AG$2=\"Suspension\",ROUND(D26/(J26-F26),3),IF($AG$2=\"Volumeter\",ROUND(D26/(J26-(F26-$AG$1)),3),\" \"))","v":{"$error":"#DIV/0!"}},null,{"$f":"IF(J26,ROUND(P26/X22*100,1),\"\")","v":""},null,{"$f":"IF(J26,ROUND(100*(1-(P26/$X$22)),1),\"\")","v":""},null,{"$f":"IF(J26,ROUND(100-(P26/'Agg Blends'!M35)*Gmm!V34,1),\"\")","v":""},null,{"$f":"IF(J26,100*(V26-T26)/V26,\"\")","v":""}]
[null,null,null,null,null,null,null,null,null,null,null,null,null,null,null,null,null,null,null,{"$f":"IF(J25,ROUND(AVERAGE(T25:T26),2),\"\")","v":""},null,{"$f":"IF(J25,ROUND(AVERAGE(V25:V26),2),\"\")","v":""},null,{"$f":"IF(J25,ROUND(AVERAGE(X25:X26),2),\"\")","v":""}]
[]
[null,null,null,null,null,null,"Trial Blend Summary"]
[null,null,null,null,null,null,null,null,null,null,null,null,"Blend",1,null,2,null,3]
[null,null,null,null,null,null,null,null,null,null,null,null,"Asphalt Content",{"$f":"IF(D11,'Agg Blends'!K46,\" \")","v":" "},null,{"$f":"IF(D18,'Agg Blends'!L46,\" \")","v":" "},null,{"$f":"IF(D25,'Agg Blends'!M46,\" \")","v":" "}]
[null,null,null,null,null,null,null,null,null,null,null,null,"Max Theo SpGr (Gmm)",{"$f":"X8","v":" "},null,{"$f":"X15","v":" "},null,{"$f":"X22","v":" "}]
[null,null,null,null,null,null,null,null,null,null,null,null,"Gmb",{"$f":"IF(J12,ROUND(AVERAGE(P11:P12),3),\"\")","v":""},null,{"$f":"IF(J19,ROUND(AVERAGE(P18:P19),3),\"\")","v":""},null,{"$f":"IF(J26,ROUND(AVERAGE(P25:P26),3),\"\")","v":""}]
[null,null,null,null,null,null,null,null,null,null,null,null,"%Gmm (Density ) Ndes ",{"$f":"IF(J12,ROUND(AVERAGE(R11:R12),1),\"\")","v":""},null,{"$f":"IF(J19,ROUND(AVERAGE(R18:R19),1),\"\")","v":""},null,{"$f":"IF(J26,ROUND(AVERAGE(R25:R26),1),\"\")","v":""}]
[null,null,null,null,null,null,null,null,null,null,null,null,"Air Voids ",{"$f":"T13","v":""},null,{"$f":"T20","v":""},null,{"$f":"T27","v":""}]
[null,null,null,null,null,null,null,null,null,null,null,null,"VMA ",{"$f":"V13","v":""},null,{"$f":"V20","v":""},null,{"$f":"V27","v":""}]
[null,null,null,null,null,null,null,null,null,null,null,null,"VFA ",{"$f":"X13","v":""},null,{"$f":"X20","v":""},null,{"$f":"X27","v":""}]
[null,null,null,null,null,null,null,null,null,null,null,null,"%Gmm (Density ) Nini",{"$f":"IF(N12,N33*((AVERAGE(N11:O12)/AVERAGE(L11:M12))/X8)*100,\"\")","v":""},null,{"$f":"IF(N19,P33*((AVERAGE(N18:O19)/AVERAGE(L18:M19))/X15)*100,\"\")","v":""},null,{"$f":"IF(N26,R33*((AVERAGE(N25:O26)/AVERAGE(L25:M26))/X22)*100,\"\")","v":""}]
[null,null,null,null,null,null,null,null,null,null,null,null,"Effective Asphalt (Pbe)",{"$f":"Gmm!J35","v":" "},null,{"$f":"Gmm!P35","v":" "},null,{"$f":"Gmm!V35","v":" "}]
[null,null,null,null,null,null,null,null,null,null,null,null,"Dust to Asphalt Ratio",{"$f":"IF(D11,ROUND('Agg Blends'!K33/Gmm!J35,1),\" \")","v":" "},null,{"$f":"IF(D18,ROUND('Agg Blends'!L33/Gmm!P35,1),\" \")","v":" "},null,{"$f":"IF(D25,ROUND('Agg Blends'!M33/Gmm!V35,1),\" \")","v":" "}]
[]
[null,null,null,null,null,null,"Selected Trial Blend",null,null,null,null,null,null,1]
[null,null,null,null,null,null,"Estimated Optium AC"]
[]
[{"$f":"Setup!$F$23&\" Method of Testing\"","v":"Suspension Method of Testing"}]

{"sheet":"VCA","index":6,"n_rows":30,"n_cols":21,"rows_kept":30,"cut":false,"hidden":false,"merged":[[0,1,0,2],[2,1,2,22],[3,2,3,4],[3,5,3,8],[3,9,3,12],[3,17,3,19],[3,20,3,21],[3,13,3,16],[5,17,5,19],[5,20,5,21],[4,2,4,4],[4,5,4,8],[4,9,4,12],[4,13,4,15],[4,18,4,19],[4,20,4,21],[17,8,17,12],[5,2,5,4],[5,5,5,7],[5,9,5,12],[5,13,5,15],[29,13,29,14],[27,0,27,12],[28,0,28,12],[29,10,29,12],[8,1,11,22],[23,13,23,14],[23,10,23,12],[19,0,19,23],[25,0,25,23],[27,13,27,14],[28,13,28,14],[22,0,22,12],[21,0,21,12],[21,13,21,14],[22,13,22,14],[17,13,17,14]]}
[null,{"$f":"Setup!A2","v":"ESB-19"}]
[]
[null,"Voids in Coarse Aggregate"]
[null,null,"Producer;",null,null,{"$f":"Setup!E7","v":0},null,null,null,"Material Class:",null,null,null,{"$f":"Setup!E10","v":0},null,null,null,"Nominal Size:",null,null,{"$f":"Setup!E9","v":0}]
[null,null,"Designed By:",null,null,{"$f":"Setup!E8","v":0},null,null,null,"Esals:",null,null,null,{"$f":"Setup!E12","v":0},null,null,null,null,"SRL:",null,{"$f":"Setup!E11","v":0}]
[null,null,"Date:",null,null,{"$f":"Setup!E6","v":"00:00:00"},null,null,null,"Rap:",null,null,null,{"$f":"Setup!E17","v":0},null,null,null,"PG Grade:",null,null,{"$f":"Setup!E14","v":0}]
[]
[]
[null,"If the mix being designed is an SMA mix, then the voids in the coarse aggregate fraction in the dry rodded condition and voids in the coarse aggregate fraction of the compacted mix needs to be determined in accordance with procedures outlined in AASHTO R46. "]
[]
[]
[]
[]
[null,"VCADRC = Voids in the coarse aggregate fraction in the dry rodded condition"]
[]
[null,"VCAMIX = Voids in the coarse aggregate fraction of the compacted mix"]
[]
[null,null,null,null,null,null,null,null,"Trial Blend selected",null,null,null,null,{"$f":"'Trial Blends'!N42","v":1}]
[]
["Determination of VCADRC"]
[]
["Bulk specific gravity of the coarse aggregate fraction(Gsb)"]
["Unit weight of coarse aggregate fraction in dry rodded condition"]
[null,null,null,null,null,null,null,null,null,null,"VCADRC",null,null,{"$f":"IF(N23,ROUND(((N22*62.4)-N23)/(N22*62.4)*100,1),\"\")","v":""}]
[]
["Determination of VCAMIX"]
[]
["Bulk specific gravity of compacted mixture(Gmb)"]
["Percent of coarse aggregate in mixture"]
[null,null,null,null,null,null,null,null,null,null,"VCAMIX",null,null,{"$f":"IF(N29,ROUND(100-(N28/N22)*N29,1),\"\")","v":""}]

{"sheet":"Design Agg","index":7,"n_rows":41,"n_cols":75,"rows_kept":41,"cut":false,"hidden":false,"merged":[[35,11,35,12],[36,11,36,12],[35,2,35,4],[32,21,32,23],[33,21,33,23],[36,5,36,6],[0,31,0,32],[2,21,2,22],[2,1,2,13],[3,10,3,11],[4,10,4,11],[3,12,3,13],[4,12,4,13],[3,2,3,3],[4,2,4,3],[1,28,1,29],[2,24,2,26],[3,4,3,5],[4,4,4,5],[3,6,3,7],[4,6,4,7],[17,24,17,25],[5,6,5,7],[3,8,3,9],[4,8,4,9],[5,8,5,9],[5,10,5,11],[5,12,5,13],[7,2,8,12],[5,2,5,3],[5,4,5,5],[21,21,21,23],[31,21,31,23],[30,21,30,23],[29,21,29,23],[27,21,27,23],[26,21,26,23],[25,21,25,23],[24,21,24,23],[23,21,23,23],[22,21,22,23],[28,21,28,23],[40,11,40,12],[39,11,39,12],[38,11,38,12],[37,11,37,12],[40,5,40,6],[39,5,39,6],[38,5,38,6],[37,5,37,6]]}
[null,{"$f":"'Trial Blends'!B1:C1","v":"ESB-19"},null,null,null,null,null,null,null,null,null,null,null,null,null,null,null,null,null,null,"Trial Blend Selected",null,{"$f":"'Trial Blends'!$N$42","v":1},null,null,null,null,null,null,null,null,null,null,null,"Nom. Size",null,null,null,null,null,null,null,null,null,null,null,null,null,null,null,null,null,{"$f":"Setup!AD10","v":0}]
[null,null,null,null,null,null,null,null,null,null,null,null,null,null,null,null,null,null,null,null,null,null,null,null,null,null,null,null,"Control Points",null,"PCS",null,null,null,{"$f":"Setup!E9","v":0}]
[null,"Design Aggregate Structure",null,null,null,null,null,null,null,null,null,null,null,null,null,null,null,null,null,null,null,"TB Selected",null,null,"AI2",null,null,".45 Power","Minimum","Maximum","Boundary","Boundary","Maximum Density Line",null,null,null,5.8150000000000004,{"$f":"IF(AI2=37.5,100,#N/A)","v":{"$error":"#N/A"}},null,null,"4.75mm",null,null,null,null,null,"9.5 mm",null,null,null,null,null,"12.5 mm",null,null,null,null,null,"19.0 mm",null,null,null,null,null,"25.0 mm",null,null,null,null,null,"37.5 mm"]
[null,null,"Producer:",null,{"$f":"Setup!E7","v":0},null,"Material Class;",null,{"$f":"Setup!E10","v":0},null,"Nominal Size:",null,{"$f":"Setup!E9","v":0},null,null,null,null,null,null,null,null,"2\"",{"$f":"IF(O34,O34,NA())","v":{"$error":"#N/A"}},null,"50mm","2\"",50,{"$f":"POWER(AA4,0.45)","v":5.8148230317277987},{"$f":"IF(AI2=37.5,BS4,\" \")","v":" "},null,null,null,{"$f":"IF(AI2=37.5,BW4,IF(AI2=25,BQ4,IF(AI2=19,BK4,IF(AI2=12.5,BE4,IF(AI2=9.5,AY4,IF(AI2=4.75,AS4))))))","v":false},null,null,null,5.109,{"$f":"IF(AI2=25,100,#N/A)","v":{"$error":"#N/A"}},null,"2\"",null,null,null,null,null,"2\"",null,null,null,null,null,"2\"",null,null,null,null,null,"2\"",null,null,null,null,null,"2\"",null,null,null,null,null,"2\"",100,null,null,null,100]
[null,null,"Designed By:",null,{"$f":"Setup!E8","v":"00:00:00"},null,"Esals:",null,{"$f":"Setup!E12","v":0},null,"SRL:",null,{"$f":"Setup!E11","v":0},null,null,null,null,null,null,null,null,"1 1/2\"",{"$f":"IF(N34,N34,NA())","v":{"$error":"#N/A"}},null,"37.5mm","1 1/2\"",37.5,{"$f":"POWER(AA5,0.45)","v":5.1087431744234335},{"$f":"IF(AI2=37.5,BS5,IF(AI2=25,BM5,IF(AI2=19,BG5,IF(AI2=12.5,BA5,IF(AI2=9.5,AU5,IF(AI2=4.75,AO5))))))","v":false},{"$f":"IF(AI2=37.5,BT5,IF(AI2=25,BN5,IF(AI2=19,BH5,IF(AI2=12.5,BB5,IF(AI2=9.5,AV5,IF(AI2=4.75,AP5))))))","v":false},null,null,{"$f":"IF(AI2=37.5,BW5,IF(AI2=25,BQ5,IF(AI2=19,BK5,IF(AI2=12.5,BE5,IF(AI2=9.5,AY5,IF(AI2=4.75,AS5))))))","v":false},null,null,null,4.2569999999999997,{"$f":"IF(AI2=19,100,#N/A)","v":{"$error":"#N/A"}},null,"1 1/2\"",null,null,null,null,null,"1 1/2\"",null,null,null,null,null,"1 1/2\"",null,null,null,null,null,"1 1/2\"",null,null,null,null,null,"1 1/2\"",100,null,null,null,100,"1 1/2\"",90,100]
[null,null,"Date:",null,{"$f":"Setup!E6","v":"00:00:00"},null,"Rap:",null,{"$f":"Setup!E17","v":0},null,"PG Grade:",null,{"$f":"Setup!E14","v":0},null,null,null,null,null,null,null,null,"1\"",{"$f":"IF(M34,M34,NA())","v":{"$error":"#N/A"}},null,"25.0mm","1\"",25,{"$f":"POWER(AA6,0.45)","v":4.2566996126039234},{"$f":"IF(AI2=37.5,BS6,IF(AI2=25,BM6,IF(AI2=19,BG6,IF(AI2=12.5,BA6,IF(AI2=9.5,AU6,IF(AI2=4.75,AO6))))))","v":false},{"$f":"IF(AI2=37.5,BT6,IF(AI2=25,BN6,IF(AI2=19,BH6,IF(AI2=12.5,BB6,IF(AI2=9.5,AV6,IF(AI2=4.75,AP6))))))","v":false},null,null,{"$f":"IF(AI2=37.5,BW6,IF(AI2=25,BQ6,IF(AI2=19,BK6,IF(AI2=12.5,BE6,IF(AI2=9.5,AY6,IF(AI2=4.75,AS6))))))","v":false},null,null,null,3.762,{"$f":"IF(AI2=12.5,100,#N/A)","v":{"$error":"#N/A"}},null,"1\"",null,null,null,null,null,"1\"",null,null,null,null,null,"1\"",null,null,null,null,null,"1\"",100,null,null,null,100,"1\"",90,100,null,null,null,"1\"",null,89]
[null,null,null,null,null,null,null,null,null,null,null,null,null,null,null,null,null,null,null,null,null,"3/4\"",{"$f":"IF(L34,L34,NA())","v":{"$error":"#N/A"}},null,"19.0mm","3/4\"",19,3.7621761023862978,{"$f":"IF(AI2=37.5,BS7,IF(AI2=25,BM7,IF(AI2=19,BG7,IF(AI2=12.5,BA7,IF(AI2=9.5,AU7,IF(AI2=4.75,AO7))))))","v":false},{"$f":"IF(AI2=37.5,BT7,IF(AI2=25,BN7,IF(AI2=19,BH7,IF(AI2=12.5,BB7,IF(AI2=9.5,AV7,IF(AI2=4.75,AP7))))))","v":false},null,null,{"$f":"IF(AI2=37.5,BW7,IF(AI2=25,BQ7,IF(AI2=19,BK7,IF(AI2=12.5,BE7,IF(AI2=9.5,AY7,IF(AI2=4.75,AS7))))))","v":false},null,null,null,3.1160000000000001,{"$f":"IF(AI2=9.5,100,IF(AI2=4.75,100,#N/A))","v":{"$error":"#N/A"}},null,"3/4\"",null,null,null,null,null,"3/4\"",null,null,null,null,null,"3/4\"",100,null,null,null,100,"3/4\"",90,100,null,null,null,"3/4\"",null,89,null,null,null,"3/4\""]
[null,null,{"$f":"IF('Trial Blends'!N42=1,CONCATENATE(\"Trial Blend 1 has been selected as the design aggregate structure and an Estimated Optium Asphalt Content of \",'Trial Blends'!N43,\" has been chosen\"),IF('Trial Blends'!N42=2,CONCATENATE(\"Trial Blend 2 has been selected as the design aggregate structure and an Estimated Optium Asphalt Content of \",'Trial Blends'!N43,\" has been chosen\"),IF('Trial Blends'!N42=3,CONCATENATE(\"Trial Blend 3 has been selected as the design aggregate structure and an Estimated Optium Asphalt Content of \",'Trial Blends'!N43,\" has been chosen\"),\" \")))","v":"Trial Blend 1 has been selected as the design aggregate structure and an Estimated Optium Asphalt Content of  has been chosen"},null,null,null,null,null,null,null,null,null,null,null,null,null,null,null,null,null,null,"1/2\"",{"$f":"IF(K34,K34,NA())","v":{"$error":"#N/A"}},null,"12.5mm","1/2\"",12.5,3.116086507375345,{"$f":"IF(AI2=37.5,BS8,IF(AI2=25,BM8,IF(AI2=19,BG8,IF(AI2=12.5,BA8,IF(AI2=9.5,AU8,IF(AI2=4.75,AO8))))))","v":false},{"$f":"IF(AI2=37.5,BT8,IF(AI2=25,BN8,IF(AI2=19,BH8,IF(AI2=12.5,BB8,IF(AI2=9.5,AV8,IF(AI2=4.75,AP8))))))","v":false},null,null,{"$f":"IF(AI2=37.5,BW8,IF(AI2=25,BQ8,IF(AI2=19,BK8,IF(AI2=12.5,BE8,IF(AI2=9.5,AY8,IF(AI2=4.75,AS8))))))","v":false},null,null,null,2.754,null,null,"1/2\"",100,null,null,null,100,"1/2\"",100,null,null,null,100,"1/2\"",90,{"$f":"IF($AB$1=\"SMA125\",99,100)","v":100},null,null,null,"1/2\"",null,89,null,null,null,"1/2\"",null,null,null,null,null,"1/2\""]
[null,null,null,null,null,null,null,null,null,null,null,null,null,null,null,null,null,null,null,null,null,"3/8\"",{"$f":"J34","v":0},null,"9.5mm","3/8\"",9.5,2.754074108566122,{"$f":"IF(AI2=37.5,BS9,IF(AI2=25,BM9,IF(AI2=19,BG9,IF(AI2=12.5,BA9,IF(AI2=9.5,AU9,IF(AI2=4.75,AO9))))))","v":false},{"$f":"IF(AI2=37.5,BT9,IF(AI2=25,BN9,IF(AI2=19,BH9,IF(AI2=12.5,BB9,IF(AI2=9.5,AV9,IF(AI2=4.75,AP9))))))","v":false},47,null,{"$f":"IF(AI2=37.5,BW9,IF(AI2=25,BQ9,IF(AI2=19,BK9,IF(AI2=12.5,BE9,IF(AI2=9.5,AY9,IF(AI2=4.75,AS9))))))","v":false},null,null,null,2.016,null,null,"3/8\"",95,100,null,null,null,"3/8\"",{"$f":"IF($AB$1=\"SMA95\",75,90)","v":90},{"$f":"IF($AB$1=\"SMA95\",95,100)","v":100},null,null,null,"3/8\"",{"$f":"IF($AB$1=\"SMA125\",70,\" \")","v":" "},{"$f":"IF($AB$1=\"SMA125\",85,89)","v":89},null,null,null,"3/8\"",null,null,null,null,null,"3/8\"",null,null,null,null,null,"3/8\"",null,null,47]
[null,null,null,null,null,null,null,null,null,null,null,null,null,null,null,null,null,null,null,null,null,"1/4\"",{"$f":"I34","v":0}]
[null,null,null,null,null,null,null,null,null,null,null,null,null,null,null,null,null,null,null,null,null,"#4",{"$f":"H34","v":0},null,"4.75mm","#4",4.75,2.0161002539629291,{"$f":"IF(AI2=37.5,BS11,IF(AI2=25,BM11,IF(AI2=19,BG11,IF(AI2=12.5,BA11,IF(AI2=9.5,AU11,IF(AI2=4.75,AO11))))))","v":false},{"$f":"IF(AI2=37.5,BT11,IF(AI2=25,BN11,IF(AI2=19,BH11,IF(AI2=12.5,BB11,IF(AI2=9.5,AV11,IF(AI2=4.75,AP11))))))","v":false},null,null,{"$f":"IF(AI2=37.5,BW11,IF(AI2=25,BQ11,IF(AI2=19,BK11,IF(AI2=12.5,BE11,IF(AI2=9.5,AY11,IF(AI2=4.75,AS11))))))","v":false},null,null,null,1.472,null,null,"#4",89,100,null,null,null,"#4",{"$f":"IF($AB$1=\"SMA95\",30,\" \")","v":" "},{"$f":"IF($AB$1=\"SMA95\",50,\" \")","v":" "},null,null,null,"#4",{"$f":"IF($AB$1=\"SMA125\",28,\" \")","v":" "},{"$f":"IF($AB$1=\"SMA125\",40,\" \")","v":" "},null,null,null,"#4",null,null,47,null,null,"#4",null,null,40,null,null,"#4"]
[null,null,null,null,null,null,null,null,null,null,null,null,null,null,null,null,null,null,null,null,null,"#8",{"$f":"G34","v":0},null,"2.36mm","#8",2.36,1.4716698795820382,{"$f":"IF(AI2=37.5,BS12,IF(AI2=25,BM12,IF(AI2=19,BG12,IF(AI2=12.5,BA12,IF(AI2=9.5,AU12,IF(AI2=4.75,AO12))))))","v":false},{"$f":"IF(AI2=37.5,BT12,IF(AI2=25,BN12,IF(AI2=19,BH12,IF(AI2=12.5,BB12,IF(AI2=9.5,AV12,IF(AI2=4.75,AP12))))))","v":false},null,null,{"$f":"IF(AI2=37.5,BW12,IF(AI2=25,BQ12,IF(AI2=19,BK12,IF(AI2=12.5,BE12,IF(AI2=9.5,AY12,IF(AI2=4.75,AS12))))))","v":false},null,null,null,1.077,null,null,"#8",null,null,null,null,null,"#8",{"$f":"IF($AB$1=\"SMA95\",20,32)","v":32},{"$f":"IF($AB$1=\"SMA95\",30,67)","v":67},47,null,null,"#8",{"$f":"IF($AB$1=\"SMA125\",18,28)","v":28},{"$f":"IF($AB$1=\"SMA125\",30,58)","v":58},39,null,null,"#8",23,49,null,null,null,"#8",19,45,null,null,null,"#8",15,41]
[null,null,null,null,null,null,null,null,null,null,null,null,null,null,null,null,null,null,null,null,null,"#16",{"$f":"F34","v":0},null,"1.18mm","#16",1.18,1.0773254099250416,{"$f":"IF(AI2=37.5,BS13,IF(AI2=25,BM13,IF(AI2=19,BG13,IF(AI2=12.5,BA13,IF(AI2=9.5,AU13,IF(AI2=4.75,AO13))))))","v":false},{"$f":"IF(AI2=37.5,BT13,IF(AI2=25,BN13,IF(AI2=19,BH13,IF(AI2=12.5,BB13,IF(AI2=9.5,AV13,IF(AI2=4.75,AP13))))))","v":false},null,null,{"$f":"IF(AI2=37.5,BW13,IF(AI2=25,BQ13,IF(AI2=19,BK13,IF(AI2=12.5,BE13,IF(AI2=9.5,AY13,IF(AI2=4.75,AS13))))))","v":false},null,null,null,0.79500000000000004,null,null,"#16",30,60,null,null,null,"#16",null,null,null,null,null,"#16",null,null,null,null,null,"#16",null,null,null,null,null,"#16",null,null,null,null,null,"#16"]
[null,null,null,null,null,null,null,null,null,null,null,null,null,null,null,null,null,null,null,null,null,"#30",{"$f":"E34","v":0},null,"600µm","#30",0.6,0.79463568224020453,{"$f":"IF(AI2=37.5,BS14,IF(AI2=25,BM14,IF(AI2=19,BG14,IF(AI2=12.5,BA14,IF(AI2=9.5,AU14,IF(AI2=4.75,AO14))))))","v":false},{"$f":"IF(AI2=37.5,BT14,IF(AI2=25,BN14,IF(AI2=19,BH14,IF(AI2=12.5,BB14,IF(AI2=9.5,AV14,IF(AI2=4.75,AP14))))))","v":false},null,null,{"$f":"IF(AI2=37.5,BW14,IF(AI2=25,BQ14,IF(AI2=19,BK14,IF(AI2=12.5,BE14,IF(AI2=9.5,AY14,IF(AI2=4.75,AS14))))))","v":false},null,null,null,0.58199999999999996,null,null,"#30",null,null,null,null,null,"#30",null,null,null,null,null,"#30",null,null,null,null,null,"#30",null,null,null,null,null,"#30",null,null,null,null,null,"#30"]
[null,null,null,null,null,null,null,null,null,null,null,null,null,null,null,null,null,null,null,null,null,"#50",{"$f":"D34","v":0},null,"300µm","#50",0.3,0.58170736792793831,{"$f":"IF(AI2=37.5,BS15,IF(AI2=25,BM15,IF(AI2=19,BG15,IF(AI2=12.5,BA15,IF(AI2=9.5,AU15,IF(AI2=4.75,AO15))))))","v":false},{"$f":"IF(AI2=37.5,BT15,IF(AI2=25,BN15,IF(AI2=19,BH15,IF(AI2=12.5,BB15,IF(AI2=9.5,AV15,IF(AI2=4.75,AP15))))))","v":false},null,null,{"$f":"IF(AI2=37.5,BW15,IF(AI2=25,BQ15,IF(AI2=19,BK15,IF(AI2=12.5,BE15,IF(AI2=9.5,AY15,IF(AI2=4.75,AS15))))))","v":false},null,null,null,0.42599999999999999,null,null,"#50",null,null,null,null,null,"#50",null,null,null,null,null,"#50",null,null,null,null,null,"#50",null,null,null,null,null,"#50",null,null,null,null,null,"#50"]
[null,null,null,null,null,null,null,null,null,null,null,null,null,null,null,null,null,null,null,null,null,"#100",{"$f":"C34","v":" "},null,"150µm","#100",0.15,0.42583471830473674,{"$f":"IF(AI2=37.5,BS16,IF(AI2=25,BM16,IF(AI2=19,BG16,IF(AI2=12.5,BA16,IF(AI2=9.5,AU16,IF(AI2=4.75,AO16))))))","v":false},{"$f":"IF(AI2=37.5,BT16,IF(AI2=25,BN16,IF(AI2=19,BH16,IF(AI2=12.5,BB16,IF(AI2=9.5,AV16,IF(AI2=4.75,AP16))))))","v":false},null,null,{"$f":"IF(AI2=37.5,BW16,IF(AI2=25,BQ16,IF(AI2=19,BK16,IF(AI2=12.5,BE16,IF(AI2=9.5,AY16,IF(AI2=4.75,AS16))))))","v":false},null,null,null,0.312,null,null,"#100",null,null,null,null,null,"#100",null,null,null,null,null,"#100",null,null,null,null,null,"#100",null,null,null,null,null,"#100",null,null,null,null,null,"#100"]
[null,null,null,null,null,null,null,null,null,null,null,null,null,null,null,null,null,null,null,null,null,"#200",{"$f":"B34","v":0},null,"75µm","#200",7.4999999999999997E-2,{"$f":"POWER(AA17,0.45)","v":0.31172925995349998},{"$f":"IF(AI2=37.5,BS17,IF(AI2=25,BM17,IF(AI2=19,BG17,IF(AI2=12.5,BA17,IF(AI2=9.5,AU17,IF(AI2=4.75,AO17))))))","v":false},{"$f":"IF(AI2=37.5,BT17,IF(AI2=25,BN17,IF(AI2=19,BH17,IF(AI2=12.5,BB17,IF(AI2=9.5,AV17,IF(AI2=4.75,AP17))))))","v":false},null,null,{"$f":"IF(AI2=37.5,BW17,IF(AI2=25,BQ17,IF(AI2=19,BK17,IF(AI2=12.5,BE17,IF(AI2=9.5,AY17,IF(AI2=4.75,AS17))))))","v":false},null,null,null,0,0,null,"#200",6,12,null,null,null,"#200",{"$f":"IF($AB$1=\"SMA95\",8,2)","v":2},{"$f":"IF($AB$1=\"SMA95\",11,10)","v":10},null,null,null,"#200",{"$f":"IF($AB$1=\"SMA125\",8,2)","v":2},{"$f":"IF($AB$1=\"SMA125\",11,10)","v":10},null,null,null,"#200",2,8,null,null,null,"#200",1,7,null,null,null,"#200",0,6]
[null,null,null,null,null,null,null,null,null,null,null,null,null,null,null,null,null,null,null,null,null,null,null,null,"Pan",null,0,0,null,null,null,null,{"$f":"IF(AI2=37.5,BW18,IF(AI2=25,BQ18,IF(AI2=19,BK18,IF(AI2=12.5,BE18,IF(AI2=9.5,AY18,IF(AI2=4.75,AS18))))))","v":false},null,null,null,null,null,null,null,null,null,null,null,0,null,null,null,null,null,0,null,null,null,null,null,0,null,null,null,null,null,0,null,null,null,null,null,0,null,null,null,null,null,0]
[]
[]
[]
[null,null,null,null,null,null,null,null,null,null,null,null,null,null,null,null,null,null,null,{"$f":"$N$34","v":0},{"$f":"$M$34","v":0},"Bulk SpGr (Gsb)",null,null,{"$f":"IF(W1=1,'Agg Blends'!K35,IF(W1=2,'Agg Blends'!L35,IF(W1=3,'Agg Blends'!M35)))","v":""}]
[null,null,null,null,null,null,null,null,null,null,null,null,null,null,null,null,null,null,null,null,null,"Eff. SpGr (Gse)",null,null,{"$f":"IF($W$1=1,Gmm!J23,IF($W$1=2,Gmm!P23,IF($W$1=3,Gmm!V23)))","v":" "}]
[null,null,null,null,null,null,null,null,null,null,null,null,null,null,null,null,null,null,null,null,null,"App. SpGr (Gsa)",null,null,{"$f":"IF(W1=1,'Agg Blends'!K37,IF(W1=2,'Agg Blends'!L37,IF(W1=3,'Agg Blends'!M37)))","v":""}]
[null,null,null,null,null,null,null,null,null,null,null,null,null,null,null,null,null,null,null,null,null,"H2O Absorption (Abs)",null,null,{"$f":"IF($W$1=1,'Agg Blends'!K36,IF($W$1=2,'Agg Blends'!L36,IF($W$1=3,'Agg Blends'!M36)))","v":""}]
[null,null,null,null,null,null,null,null,null,null,null,null,null,null,null,null,null,null,null,null,null,"AC Absorption (Pba)",null,null,{"$f":"IF($W$1=1,Gmm!J29,IF($W$1=2,Gmm!P29,IF($W$1=3,Gmm!V29)))","v":" "}]
[null,null,null,null,null,null,null,null,null,null,null,null,null,null,null,null,null,null,null,null,null,"Sand Equivalency",null,null,{"$f":"IF($W$1=1,'Agg Blends'!K38,IF($W$1=2,'Agg Blends'!L38,IF($W$1=3,'Agg Blends'!M38)))","v":""}]
[null,null,null,null,null,null,null,null,null,null,null,null,null,null,null,null,null,null,null,null,null,"Flat & Elongated 3:1",null,null,{"$f":"IF($W$1=1,'Agg Blends'!K39,IF($W$1=2,'Agg Blends'!L39,IF($W$1=3,'Agg Blends'!M39)))","v":""}]
[null,null,null,null,null,null,null,null,null,null,null,null,null,null,null,null,null,null,null,null,null,"Flat & Elongated 5:1",null,null,{"$f":"IF($W$1=1,'Agg Blends'!K40,IF($W$1=2,'Agg Blends'!L40,IF($W$1=3,'Agg Blends'!M40)))","v":""}]
[null,null,null,null,null,null,null,null,null,null,null,null,null,null,null,null,null,null,null,null,null,"Uncompacted Voids",null,null,{"$f":"IF($W$1=1,'Agg Blends'!K42,IF($W$1=2,'Agg Blends'!L42,IF($W$1=3,'Agg Blends'!M42)))","v":""}]
[null,null,null,null,null,null,null,null,null,null,null,null,null,null,null,null,null,null,null,null,null,"CA Angularity (1)",null,null,{"$f":"IF($W$1=1,'Agg Blends'!K43,IF($W$1=2,'Agg Blends'!L43,IF($W$1=3,'Agg Blends'!M43)))","v":""}]
[null,"75µm","150µm","300µm","600µm","1.18mm","2.36mm","4.75mm","6.33mm","9.5mm","12.5mm","19.0mm","25.0mm","37.5mm","50mm",null,null,null,null,null,null,"CA Angularity (2)",null,null,{"$f":"IF($W$1=1,'Agg Blends'!K44,IF($W$1=2,'Agg Blends'!L44,IF($W$1=3,'Agg Blends'!M44)))","v":""}]
[null,"#200","#100","#50","#30","#16","#8","#4","1/4\"","3/8\"","1/2\"","3/4\"","1\"","1 1/2\"","2\"",null,null,null,null,null,null,"VCAMIX",null,null,{"$f":"VCA!N30","v":""}]
[null,{"$f":"IF($W$1=1,'Agg Blends'!$K33,IF($W$1=2,'Agg Blends'!$L33,IF($W$1=3,'Agg Blends'!$M33,\" \")))","v":0},{"$f":"IF($W$1=1,'Agg Blends'!$K32,IF($W$1=2,'Agg Blends'!$L32,IF($W$1=3,'Agg Blends'!$M32,\" \")))","v":" "},{"$f":"IF($W$1=1,'Agg Blends'!$K31,IF($W$1=2,'Agg Blends'!$L31,IF($W$1=3,'Agg Blends'!$M31,\" \")))","v":0},{"$f":"IF($W$1=1,'Agg Blends'!$K30,IF($W$1=2,'Agg Blends'!$L30,IF($W$1=3,'Agg Blends'!$M30,\" \")))","v":0},{"$f":"IF($W$1=1,'Agg Blends'!$K29,IF($W$1=2,'Agg Blends'!$L29,IF($W$1=3,'Agg Blends'!$M29,\" \")))","v":0},{"$f":"IF($W$1=1,'Agg Blends'!$K28,IF($W$1=2,'Agg Blends'!$L28,IF($W$1=3,'Agg Blends'!$M28,\" \")))","v":0},{"$f":"IF($W$1=1,'Agg Blends'!$K27,IF($W$1=2,'Agg Blends'!$L27,IF($W$1=3,'Agg Blends'!$M27,\" \")))","v":0},{"$f":"IF($W$1=1,'Agg Blends'!$K26,IF($W$1=2,'Agg Blends'!$L26,IF($W$1=3,'Agg Blends'!$M26,\" \")))","v":0},{"$f":"IF($W$1=1,'Agg Blends'!$K25,IF($W$1=2,'Agg Blends'!$L25,IF($W$1=3,'Agg Blends'!$M25,\" \")))","v":0},{"$f":"IF($W$1=1,'Agg Blends'!$K24,IF($W$1=2,'Agg Blends'!$L24,IF($W$1=3,'Agg Blends'!$M24,\" \")))","v":0},{"$f":"IF($W$1=1,'Agg Blends'!$K23,IF($W$1=2,'Agg Blends'!$L23,IF($W$1=3,'Agg Blends'!$M23,\" \")))","v":0},{"$f":"IF($W$1=1,'Agg Blends'!$K22,IF($W$1=2,'Agg Blends'!$L22,IF($W$1=3,'Agg Blends'!$M22,\" \")))","v":0},{"$f":"IF($W$1=1,'Agg Blends'!$K21,IF($W$1=2,'Agg Blends'!$L21,IF($W$1=3,'Agg Blends'!$M21,\" \")))","v":0},{"$f":"IF($W$1=1,'Agg Blends'!$K20,IF($W$1=2,'Agg Blends'!$L20,IF($W$1=3,'Agg Blends'!$M20,\" \")))","v":0},null,null,null,null,null,null,"VCADRC",null,null,{"$f":"VCA!N24","v":""},null,null,null,null,null,null,null,null,null,null,null,null,null,null,{"$f":"$N$34","v":0}]
[null,0.31172925995349998,0.42583471830473674,0.58170736792793831,0.79463568224020453,1.0773254099250416,1.4716698795820382,2.0161002539629291,2.754074108566122,3.116086507375345,3.7621761023862978,4.2566996126039234,5.1087431744234335,5.8148230317277987]
[null,null,"VCAMIX / VCADRC",null,null,{"$f":"Y33","v":""},{"$f":"Y34","v":""},null,"Flat & Elongated 3:1",null,null,{"$f":"Y28","v":""}]
[null,null,"Bulk SpGr (Gsb)",null,null,{"$f":"Y22","v":""},null,null,"Flat & Elongated 5:1",null,null,{"$f":"Y29","v":""}]
[null,null,"Eff. SpGr (Gse)",null,null,{"$f":"Y23","v":" "},null,null,"CA Angularity (1)",null,null,{"$f":"Y31","v":""}]
[null,null,"App. SpGr (Gsa)",null,null,{"$f":"Y24","v":""},null,null,"CA Angularity (2)",null,null,{"$f":"Y32","v":""}]
[null,null,"H2O Absorption (Abs)",null,null,{"$f":"Y25","v":""},null,null,"Sand Equivalency",null,null,{"$f":"Y27","v":""}]
[null,null,"AC Absorption (Pba)",null,null,{"$f":"Y26","v":" "},null,null,"Uncompacted Voids",null,null,{"$f":"Y30","v":""}]

{"sheet":"Gmm2","index":8,"n_rows":35,"n_cols":36,"rows_kept":35,"cut":false,"hidden":false,"merged":[[34,12,34,15],[34,4,34,11],[30,18,30,21],[24,1,24,5],[25,1,25,5],[26,1,26,5],[27,1,27,5],[28,1,28,5],[29,1,29,5],[30,6,30,9],[30,10,30,13],[30,14,30,17],[24,20,24,21],[24,18,24,19],[24,16,24,17],[24,14,24,15],[24,12,24,13],[24,10,24,11],[24,8,24,9],[24,6,24,7],[29,18,29,19],[28,18,28,19],[27,18,27,19],[26,18,26,19],[5,32,5,35],[7,32,7,35],[8,32,8,35],[9,32,9,35],[17,10,17,11],[18,10,18,11],[7,8,7,12],[17,12,17,13],[18,12,18,13],[17,8,17,9],[7,13,7,14],[12,0,12,22],[15,8,15,9],[16,8,16,9],[14,10,14,11],[14,12,14,13],[15,12,15,13],[16,12,16,13],[9,5,10,18],[16,10,16,11],[15,10,15,11],[18,8,18,9],[29,20,29,21],[28,20,28,21],[27,20,27,21],[26,20,26,21],[21,0,21,22],[23,6,23,7],[23,8,23,9],[23,10,23,11],[23,12,23,13],[23,14,23,15],[23,16,23,17],[23,18,23,19],[23,20,23,21],[25,20,25,21],[29,16,29,17],[28,16,28,17],[27,16,27,17],[26,16,26,17],[25,18,25,19],[25,10,25,11],[25,8,25,9],[26,14,26,15],[0,1,0,2],[2,1,2,22],[3,2,3,4],[3,5,3,8],[3,9,3,12],[3,17,3,19],[3,20,3,21],[5,20,5,21],[4,2,4,4],[4,5,4,8],[4,9,4,12],[4,13,4,15],[4,18,4,19],[4,20,4,21],[5,2,5,4],[5,5,5,7],[5,9,5,12],[5,13,5,15],[5,17,5,19],[3,13,3,16],[32,9,32,16],[29,6,29,7],[28,6,28,7],[27,6,27,7],[26,6,26,7],[25,6,25,7],[26,10,26,11],[27,10,27,11],[28,10,28,11],[29,10,29,11],[29,8,29,9],[28,8,28,9],[27,8,27,9],[26,8,26,9],[29,12,29,13],[28,12,28,13],[27,12,27,13],[26,12,26,13],[25,12,25,13],[29,14,29,15],[28,14,28,15],[27,14,27,15],[25,14,25,15],[25,16,25,17]]}
[null,{"$f":"Setup!A2","v":"ESB-19"},null,null,null,null,null,null,null,null,null,null,null,null,null,null,null,null,null,null,null,null,null,null,null,null,null,null,null,null,null,null,"Measured Gmm"]
[null,null,null,null,null,null,null,null,null,null,null,null,null,null,null,null,null,null,null,null,null,null,null,null,null,null,null,null,null,null,null,null,"Calculated Gmm"]
[null,"Maximum Specific Gravity of AC Trials"]
[null,null,"Producer;",null,null,{"$f":"Setup!E7","v":0},null,null,null,"Material Class:",null,null,null,{"$f":"Setup!E10","v":0},null,null,null,"Nominal Size:",null,null,{"$f":"Setup!E9","v":0}]
[null,null,"Designed By:",null,null,{"$f":"Setup!E8","v":0},null,null,null,"Esals:",null,null,null,{"$f":"Setup!E12","v":0},null,null,null,null,"SRL:",null,{"$f":"Setup!E11","v":0}]
[null,null,"Date:",null,null,{"$f":"Setup!E6","v":"00:00:00"},null,null,null,"Rap:",null,null,null,{"$f":"Setup!E17","v":0},null,null,null,"PG Grade:",null,null,{"$f":"Setup!E14","v":0},null,null,null,null,null,null,null,null,null,null,null,{"$f":"IF('Trial Blends'!$N$42=1,Gmm!J16,IF('Trial Blends'!$N$42=2,Gmm!P16,IF('Trial Blends'!$N$42=3,Gmm!V16)))","v":" "}]
[null,null,null,null,null,null,null,null,null,null,null,null,null,null,null,null,null,null,null,null,null,null,null,null,null,null,null,null,null,null,null,null,{"$f":"K16","v":-0.5},{"$f":"K17","v":0},{"$f":"K18","v":0.5},{"$f":"K19","v":1}]
[null,null,null,null,null,null,null,null,"Trial Blend selected",null,null,null,null,{"$f":"'Trial Blends'!N42","v":1},null,null,null,null,null,null,null,null,null,null,null,null,null,null,null,null,null,"Gsb selected",{"$f":"IF('Trial Blends'!$N$42=1,Gmm!J27,IF('Trial Blends'!$N$42=2,Gmm!P27,IF('Trial Blends'!$N$42=3,Gmm!V27)))","v":""}]
[null,null,null,null,null,null,null,null,null,null,null,null,null,null,null,null,null,null,null,null,null,null,null,null,null,null,null,null,null,null,null,"AC in test mix",{"$f":"IF('Trial Blends'!N42=1,Gmm!J20,IF('Trial Blends'!N42=2,Gmm!P20,IF('Trial Blends'!N42=3,Gmm!V20)))","v":""}]
[null,null,null,null,null,"This Worksheet gives the option to use Calculated or Measured Maximum Specific Gravities for the AC Trials ",null,null,null,null,null,null,null,null,null,null,null,null,null,null,null,null,null,null,null,null,null,null,null,null,null,"Gb",{"$f":"Setup!E15","v":0}]
[null,null,null,null,null,null,null,null,null,null,null,null,null,null,null,null,null,null,null,null,null,null,null,null,null,null,null,null,null,null,null,4,{"$f":"ROUND(AG9/AG10,3)","v":{"$error":"#VALUE!"}},{"$f":"ROUND(AG9/AG10,3)","v":{"$error":"#VALUE!"}},{"$f":"ROUND(AG9/AG10,3)","v":{"$error":"#VALUE!"}},{"$f":"ROUND(AG9/AG10,3)","v":{"$error":"#VALUE!"}}]
[null,null,null,null,null,null,null,null,null,null,null,null,null,null,null,null,null,null,null,null,null,null,null,null,null,null,null,null,null,null,null,5,{"$f":"ROUND(100-AG9,1)","v":{"$error":"#VALUE!"}},{"$f":"ROUND(100-AG9,1)","v":{"$error":"#VALUE!"}},{"$f":"ROUND(100-AG9,1)","v":{"$error":"#VALUE!"}},{"$f":"ROUND(100-AG9,1)","v":{"$error":"#VALUE!"}}]
["Calculated Maximum Specific Gravity of the Selected Trial Blend at the Estiminated Optium Asphalt ",null,null,null,null,null,null,null,null,null,null,null,null,null,null,null,null,null,null,null,null,null,null,null,null,null,null,null,null,null,null,6,{"$f":"ROUND(AG6*AG12,3)","v":{"$error":"#VALUE!"}},{"$f":"ROUND(AG6*AH12,3)","v":{"$error":"#VALUE!"}},{"$f":"ROUND(AG6*AI12,3)","v":{"$error":"#VALUE!"}},{"$f":"ROUND(AG6*AJ12,3)","v":{"$error":"#VALUE!"}}]
[null,null,null,null,null,null,null,null,null,null,null,null,null,null,null,null,null,null,null,null,null,null,null,null,null,null,null,null,null,null,null,7,{"$f":"ROUND(AG11*AG6,3)","v":{"$error":"#VALUE!"}},{"$f":"ROUND(AH11*AG6,3)","v":{"$error":"#VALUE!"}},{"$f":"ROUND(AI11*AG6,3)","v":{"$error":"#VALUE!"}},{"$f":"ROUND(AJ11*AG6,3)","v":{"$error":"#VALUE!"}}]
[null,null,null,null,null,null,null,null,null,null,"% AC",null,"Gmm",null,null,null,null,null,null,null,null,null,null,null,null,null,null,null,null,null,null,8,{"$f":"ROUND(100-AG14,3)","v":{"$error":"#VALUE!"}},{"$f":"ROUND(100-AH14,3)","v":{"$error":"#VALUE!"}},{"$f":"ROUND(100-AI14,3)","v":{"$error":"#VALUE!"}},{"$f":"ROUND(100-AJ14,3)","v":{"$error":"#VALUE!"}}]
[null,null,null,null,null,null,null,null,-0.5,null,{"$f":"K17-0.5","v":-0.5},null,{"$f":"IF(ISERROR(AG21),\"\",AG21)","v":""},null,null,null,null,null,null,null,null,null,null,null,null,null,null,null,null,null,null,9,{"$f":"ROUND(AG13/AG15,3)","v":{"$error":"#VALUE!"}},{"$f":"ROUND(AH13/AH15,3)","v":{"$error":"#VALUE!"}},{"$f":"ROUND(AI13/AI15,3)","v":{"$error":"#VALUE!"}},{"$f":"ROUND(AJ13/AJ15,3)","v":{"$error":"#VALUE!"}}]
[null,null,null,null,null,null,null,null,"Est. AC",null,{"$f":"'Trial Blends'!N43","v":0},null,{"$f":"IF(ISERROR(AH21),\"\",AH21)","v":""},null,null,null,null,null,null,null,null,null,null,null,null,null,null,null,null,null,null,10,{"$f":"ROUND(100-K16,1)","v":100.5},{"$f":"ROUND(100-K17,1)","v":100},{"$f":"ROUND(100-K18,1)","v":99.5},{"$f":"ROUND(100-K19,1)","v":99}]
[null,null,null,null,null,null,null,null,"+0.5",null,{"$f":"K17+0.5","v":0.5},null,{"$f":"IF(ISERROR(AI21),\"\",AI21)","v":""},null,null,null,null,null,null,null,null,null,null,null,null,null,null,null,null,null,null,11,{"$f":"ROUND(K16/AG10,3)","v":{"$error":"#DIV/0!"}},{"$f":"ROUND(K17/AG10,3)","v":{"$error":"#DIV/0!"}},{"$f":"ROUND(K18/AG10,3)","v":{"$error":"#DIV/0!"}},{"$f":"ROUND(K19/AG10,3)","v":{"$error":"#DIV/0!"}}]
[null,null,null,null,null,null,null,null,"+1.0",null,{"$f":"K17+1","v":1},null,{"$f":"IF(ISERROR(AJ21),\"\",AJ21)","v":""},null,null,null,null,null,null,null,null,null,null,null,null,null,null,null,null,null,null,12,{"$f":"ROUND(AG17/AG16,3)","v":{"$error":"#VALUE!"}},{"$f":"ROUND(AH17/AH16,3)","v":{"$error":"#VALUE!"}},{"$f":"ROUND(AI17/AI16,3)","v":{"$error":"#VALUE!"}},{"$f":"ROUND(AJ17/AJ16,3)","v":{"$error":"#VALUE!"}}]
[null,null,null,null,null,null,null,null,null,null,null,null,null,null,null,null,null,null,null,null,null,null,null,null,null,null,null,null,null,null,null,13,{"$f":"ROUND(AG19+AG18,3)","v":{"$error":"#VALUE!"}},{"$f":"ROUND(AH19+AH18,3)","v":{"$error":"#VALUE!"}},{"$f":"ROUND(AI19+AI18,3)","v":{"$error":"#VALUE!"}},{"$f":"ROUND(AJ19+AJ18,3)","v":{"$error":"#VALUE!"}}]
[null,null,null,null,null,null,null,null,null,null,null,null,null,null,null,null,null,null,null,null,null,null,null,null,null,null,null,null,null,null,null,14,{"$f":"ROUND(100/AG20,3)","v":{"$error":"#VALUE!"}},{"$f":"ROUND(100/AH20,3)","v":{"$error":"#VALUE!"}},{"$f":"ROUND(100/AI20,3)","v":{"$error":"#VALUE!"}},{"$f":"ROUND(100/AJ20,3)","v":{"$error":"#VALUE!"}}]
["Measured Maximum Specific Gravity of the Selected Trial Blend at the Estiminated Optium Asphalt ",null,null,null,null,null,null,null,null,null,null,null,null,null,null,null,null,null,null,null,null,null,null,null,null,null,null,null,null,null,null,"Absor. AC",{"$f":"100*((AG16-AG8)/(AG8*AG16))*AG10","v":{"$error":"#VALUE!"}},{"$f":"100*((AH16-AG8)/(AG8*AH16))*$AG$10","v":{"$error":"#VALUE!"}},{"$f":"100*((AI16-AG8)/(AI16*AG8))*$AG$10","v":{"$error":"#VALUE!"}},{"$f":"100*((AJ16-AG8)/(AG8*AJ16))*$AG$10","v":{"$error":"#VALUE!"}}]
[null,null,null,null,null,null,null,null,null,null,null,null,null,null,null,null,null,null,null,null,null,null,null,null,null,null,null,null,null,null,null,"Pbe",{"$f":"ROUND(K16-(AG22/100)*(100-K16),1)","v":{"$error":"#VALUE!"}},{"$f":"ROUND(K17-(AH22/100)*(100-K17),1)","v":{"$error":"#VALUE!"}},{"$f":"ROUND(K18-(AI22/100)*(100-K18),1)","v":{"$error":"#VALUE!"}},{"$f":"ROUND(K19-(AJ22/100)*(100-K18),1)","v":{"$error":"#VALUE!"}}]
[null,null,null,null,null,null,{"$f":"K16","v":-0.5},null,"% AC",null,{"$f":"K17","v":0},null,"% AC",null,{"$f":"K18","v":0.5},null,"% AC",null,{"$f":"K19","v":1},null,"% AC"]
[null,"Sample Number",null,null,null,null,1,null,2,null,1,null,2,null,1,null,2,null,1,null,2]
[null,"Dry Wt. of Sample",null,null,null,null,null,null,null,null,null,null,null,null,null,null,null,null,null,null,null,null,null,null,null,null,null,null,null,null,null,"Gse",{"$f":"(100-G24)/(100/G31-G24/$AG$10)","v":{"$error":"#VALUE!"}},{"$f":"(100-K24)/(100/K31-K24/$AG$10)","v":{"$error":"#VALUE!"}},{"$f":"(100-O24)/(100/O31-O24/$AG$10)","v":{"$error":"#VALUE!"}},{"$f":"(100-S24)/(100/S31-S24/$AG$10)","v":{"$error":"#VALUE!"}}]
[null,{"$f":"IF(Setup!$E$19=\"Suspension\",\"Mass of Pyc in Water\",\"Mass of Pyc + Water\")","v":"Mass of Pyc + Water"},null,null,null,null,{"$f":"IF(G26,Setup!$F$20,\" \")","v":" "},null,{"$f":"IF(I26,Setup!$F$20,\" \")","v":" "},null,{"$f":"IF(K26,Setup!$F$20,\" \")","v":" "},null,{"$f":"IF(M26,Setup!$F$20,\" \")","v":" "},null,{"$f":"IF(O26,Setup!$F$20,\" \")","v":" "},null,{"$f":"IF(Q26,Setup!$F$20,\" \")","v":" "},null,{"$f":"IF(S26,Setup!$F$20,\" \")","v":" "},null,{"$f":"IF(U26,Setup!$F$20,\" \")","v":" "},null,null,null,null,null,null,null,null,null,null,"Absor AC",{"$f":"100*((AG26-$AG$8)/($AG$8*$AG$26))*$AG$10","v":{"$error":"#VALUE!"}},{"$f":"100*((AH26-$AG$8)/($AG$8*$AH$26))*$AG$10","v":{"$error":"#VALUE!"}},{"$f":"100*((AI26-$AG$8)/($AG$8*$AI$26))*$AG$10","v":{"$error":"#VALUE!"}},{"$f":"100*((AJ26-$AG$8)/($AG$8*$AJ$26))*$AG$10","v":{"$error":"#VALUE!"}}]
[null,{"$f":"IF(Setup!F19=\"Suspension\",\"Mass samp+Pyc in H2O\",\"Mass Pyc + Mix + Water\")","v":"Mass samp+Pyc in H2O"},null,null,null,null,null,null,null,null,null,null,null,null,null,null,null,null,null,null,null,null,null,null,null,null,null,null,null,null,null,"Pbe",{"$f":"ROUND(G24-(AG27/100)*(100-G24),1)","v":{"$error":"#VALUE!"}},{"$f":"ROUND(K24-(AH27/100)*(100-K24),1)","v":{"$error":"#VALUE!"}},{"$f":"ROUND(O24-(AI27/100)*(100-O24),1)","v":{"$error":"#VALUE!"}},{"$f":"ROUND(S24-(AJ27/100)*(100-S24),1)","v":{"$error":"#VALUE!"}}]
[null,"Volume of Voidless Mix",null,null,null,null,{"$f":"IF(G28,ROUND(G26+G27-G28,1),\" \")","v":" "},null,{"$f":"IF(I28,ROUND(I26+I27-I28,1),\" \")","v":" "},null,{"$f":"IF(K28,ROUND(K26+K27-K28,1),\" \")","v":" "},null,{"$f":"IF(M28,ROUND(M26+M27-M28,1),\" \")","v":" "},null,{"$f":"IF(O28,ROUND(O26+O27-O28,1),\" \")","v":" "},null,{"$f":"IF(Q28,ROUND(Q26+Q27-Q28,1),\" \")","v":" "},null,{"$f":"IF(S28,ROUND(S26+S27-S28,1),\" \")","v":" "},null,{"$f":"IF(U28,ROUND(U26+U27-U28,1),\" \")","v":" "}]
[null,"Max. Sp. Gr. Of Mix",null,null,null,null,{"$f":"IF(G26,ROUND(G26/G29,3),\" \")","v":" "},null,{"$f":"IF(I26,ROUND(I26/I29,3),\" \")","v":" "},null,{"$f":"IF(K26,ROUND(K26/K29,3),\" \")","v":" "},null,{"$f":"IF(M26,ROUND(M26/M29,3),\" \")","v":" "},null,{"$f":"IF(O26,ROUND(O26/O29,3),\" \")","v":" "},null,{"$f":"IF(Q26,ROUND(Q26/Q29,3),\" \")","v":" "},null,{"$f":"IF(S26,ROUND(S26/S29,3),\" \")","v":" "},null,{"$f":"IF(U26,ROUND(U26/U29,3),\" \")","v":" "}]
[null,null,null,null,null,null,{"$f":"IF(G28,ROUND(AVERAGE(G30:I30),3),\" \")","v":" "},null,null,null,{"$f":"IF(K28,ROUND(AVERAGE(K30:M30),3),\" \")","v":" "},null,null,null,{"$f":"IF(O28,ROUND(AVERAGE(O30:Q30),3),\" \")","v":" "},null,null,null,{"$f":"IF(S28,ROUND(AVERAGE(S30:U30),3),\" \")","v":" "}]
[]
[null,null,null,null,null,null,null,null,null,{"$f":"Setup!$F$19&\" Method of Testing\"","v":"Suspension Method of Testing"}]
[]
[null,null,null,null,"Select Gmm to be used in AC Trials",null,null,null,null,null,null,null,"Calculated Gmm"]

{"sheet":"AC Trials","index":9,"n_rows":278,"n_cols":46,"rows_kept":278,"cut":false,"hidden":false,"merged":[[37,23,37,24],[35,15,35,16],[35,17,35,18],[35,19,35,20],[35,21,35,22],[35,23,35,24],[35,1,35,2],[35,3,35,4],[35,5,35,8],[35,13,35,14],[35,9,35,10],[35,11,35,12],[34,1,34,2],[34,3,34,4],[34,5,34,8],[34,13,34,14],[34,9,34,10],[34,11,34,12],[29,23,29,24],[31,1,31,2],[31,15,31,22],[31,23,31,24],[32,11,33,12],[34,15,34,16],[34,17,34,18],[34,19,34,20],[34,21,34,22],[32,23,33,24],[32,1,33,2],[32,3,33,4],[32,5,33,8],[32,13,33,14],[32,9,33,10],[18,23,18,24],[18,1,18,2],[18,3,18,4],[27,21,27,22],[24,15,25,16],[24,23,25,24],[24,1,25,2],[24,3,25,4],[24,5,25,8],[24,13,25,14],[26,15,26,16],[26,17,26,18],[26,19,26,20],[26,21,26,22],[26,23,26,24],[26,1,26,2],[24,19,25,20],[27,1,27,2],[27,3,27,4],[27,5,27,8],[27,13,27,14],[27,11,27,12],[27,9,27,10],[26,9,26,10],[23,1,23,2],[23,15,23,22],[23,23,23,24],[24,9,25,10],[24,11,25,12],[19,23,19,24],[19,1,19,2],[19,3,19,4],[19,5,19,8],[19,13,19,14],[19,9,19,10],[19,11,19,12],[20,23,20,24],[19,15,19,16],[19,17,19,18],[19,19,19,20],[19,21,19,22],[20,1,20,2],[20,3,20,4],[8,23,9,24],[8,9,9,10],[11,23,11,24],[10,23,10,24],[12,23,12,24],[13,23,13,24],[16,23,17,24],[11,9,11,10],[8,11,9,12],[10,11,10,12],[11,11,11,12],[16,9,17,10],[16,11,17,12],[13,19,13,20],[13,21,13,22],[15,23,15,24],[15,3,15,10],[15,11,15,14],[16,17,17,18],[16,19,17,20],[16,21,17,22],[16,15,17,16],[11,15,11,16],[11,17,11,18],[7,23,7,24],[7,3,7,10],[7,11,7,14],[8,1,9,2],[8,3,9,4],[8,5,9,8],[16,1,17,2],[16,3,17,4],[16,5,17,8],[16,13,17,14],[15,1,15,2],[15,15,15,22],[11,19,11,20],[11,21,11,22],[11,1,11,2],[11,3,11,4],[11,5,11,8],[11,13,11,14],[10,15,10,16],[10,17,10,18],[10,19,10,20],[10,21,10,22],[10,1,10,2],[10,3,10,4],[0,1,0,2],[3,2,3,4],[3,5,3,8],[3,9,3,14],[3,19,3,21],[3,22,3,23],[5,22,5,23],[4,2,4,4],[4,5,4,8],[4,9,4,14],[4,15,4,17],[4,20,4,21],[4,22,4,23],[5,2,5,4],[5,5,5,7],[5,9,5,14],[5,15,5,17],[5,19,5,21],[2,7,2,17],[40,19,40,22],[41,19,41,22],[40,16,40,18],[39,19,39,22],[29,19,29,20],[29,21,29,22],[32,15,33,16],[32,17,33,18],[32,19,33,20],[32,21,33,22],[37,19,37,20],[37,21,37,22],[28,19,28,20],[28,21,28,22],[28,23,28,24],[36,21,36,22],[36,23,36,24],[24,21,25,22],[21,19,21,20],[27,19,27,20],[27,23,27,24],[21,21,21,22],[21,23,21,24],[34,23,34,24],[12,21,12,22],[8,13,9,14],[8,15,9,16],[8,17,9,18],[8,19,9,20],[8,21,9,22],[20,21,20,22],[10,13,10,14],[18,13,18,14],[18,15,18,16],[18,17,18,18],[18,19,18,20],[18,21,18,22],[40,10,40,12],[40,7,40,9],[40,3,40,6],[39,3,39,18],[41,16,41,18],[41,13,41,15],[42,13,42,15],[40,13,40,15],[24,17,25,18],[27,15,27,16],[27,17,27,18],[41,3,41,6],[26,13,26,14],[26,11,26,12],[26,3,26,4],[26,5,26,8],[28,3,28,4],[28,5,28,8],[28,9,28,10],[28,11,28,12],[28,13,28,14],[41,7,41,9],[28,15,28,16],[28,17,28,18],[45,13,45,15],[46,13,46,15],[47,13,47,15],[42,10,42,12],[41,10,41,12],[46,21,46,22],[47,21,47,22],[48,13,48,15],[49,13,49,15],[49,10,49,12],[48,10,48,12],[47,10,47,12],[46,10,46,12],[45,10,45,12],[44,10,44,12],[49,7,49,9],[48,7,48,9],[47,7,47,9],[46,7,46,9],[45,7,45,9],[44,7,44,9],[43,7,43,9],[42,7,42,9],[12,19,12,20],[36,19,36,20],[20,5,20,8],[20,9,20,10],[20,11,20,12],[20,13,20,14],[20,15,20,16],[20,17,20,18],[20,19,20,20],[23,3,23,10],[23,11,23,14],[31,3,31,10],[31,12,31,14],[43,10,43,12],[43,13,43,15],[44,13,44,15],[18,11,18,12],[51,0,51,25],[49,3,49,6],[48,3,48,6],[47,3,47,6],[46,3,46,6],[45,3,45,6],[44,3,44,6],[43,3,43,6],[42,3,42,6],[49,19,49,22],[48,19,48,22],[44,19,44,22],[43,19,43,22],[42,19,42,22],[49,16,49,18],[48,16,48,18],[47,16,47,18],[46,16,46,18],[45,16,45,18],[44,16,44,18],[43,16,43,18],[42,16,42,18],[45,20,45,21],[7,1,7,2],[28,1,28,2],[3,15,3,18],[36,1,36,2],[36,3,36,4],[36,5,36,8],[36,9,36,10],[36,11,36,12],[36,13,36,14],[36,15,36,16],[36,17,36,18],[12,1,12,2],[12,3,12,4],[12,5,12,8],[12,9,12,10],[12,11,12,12],[12,13,12,14],[12,15,12,16],[12,17,12,18],[7,15,7,22],[10,5,10,8],[10,9,10,10],[18,5,18,8],[18,9,18,10]]}
[null,{"$f":"Setup!A2","v":"ESB-19"},null,null,null,null,null,null,null,null,null,null,null,null,null,null,null,null,null,null,null,null,null,null,null,null,null,null,null,null,null,null,{"$f":"Setup!F24","v":0},null,{"$f":"Setup!F23","v":"Suspension"}]
[null,null,null,null,null,null,null,null,null,null,null,null,null,null,null,null,null,null,null,null,null,null,null,null,null,null,null,null,null,null,null,null,{"$f":"'Gmm2'!M35","v":"Calculated Gmm"}]
[null,null,null,null,null,null,null,"Varying Asphalt Content For Trial Blend",null,null,null,null,null,null,null,null,null,null,{"$f":"'Trial Blends'!N42","v":1},null,null,null,null,null,null,null,null,null,null,null,null,null,{"$f":"'Trial Blends'!N42","v":1}]
[null,null,"Producer;",null,null,{"$f":"Setup!E7","v":0},null,null,null,"Material Class:",null,null,null,null,null,{"$f":"Setup!E10","v":0},null,null,null,"Nominal Size:",null,null,{"$f":"Setup!E9","v":0},null,null,null,null,null,null,null,null,null,{"$f":"IF(AG3=1,'Agg Blends'!K35,IF(AG3=2,'Agg Blends'!L35,IF(AG3=3,'Agg Blends'!M35)))","v":""}]
[null,null,"Designed By:",null,null,{"$f":"Setup!E8","v":0},null,null,null,"Esals:",null,null,null,null,null,{"$f":"Setup!E12","v":0},null,null,null,null,"SRL:",null,{"$f":"Setup!E11","v":0},null,null,null,null,null,null,null,null,null,{"$f":"100-B8","v":100.5},"%Agg AC1"]
[null,null,"Date:",null,null,{"$f":"Setup!E6","v":"00:00:00"},null,null,null,"Rap:",null,null,null,null,null,{"$f":"Setup!E17","v":0},null,null,null,"PG Grade:",null,null,{"$f":"Setup!E14","v":0},null,null,null,null,null,null,null,null,null,{"$f":"100-B16","v":100},"%Agg AC2"]
[null,null,null,null,null,null,null,null,null,null,null,null,null,null,null,null,null,null,null,null,null,null,null,null,null,null,null,null,null,null,null,null,{"$f":"100-B24","v":99.5},"%Agg AC3"]
[null,{"$f":"'Gmm2'!K16","v":-0.5},null,"Asphalt Content",null,null,null,null,null,null,null,"Samp Ht.",null,null,null,"Maximum Theoretical Gravity (Gmm) =",null,null,null,null,null,null,null,{"$f":"IF($AG$2=\"Measured Gmm\",'Gmm2'!G31,'Gmm2'!M16)","v":""},null,null,null,null,null,null,null,null,{"$f":"100-B32","v":99},"%Agg AC4"]
[null,null,null,"Dry Weight",null,{"$f":"IF(Setup!$F$23=\"Suspension\",\"Mass Spec. in H2O\",\"Mass Pyc + Specimen + Water\")","v":"Mass Spec. in H2O"},null,null,null,"SSD Weight",null,"Height @ Nini",null,"Height @ Ndes",null,"Gmb",null,"% Gmm",null,"Voids",null,"VMA",null,"VFA"]
[null,null,null,null,null,{"$f":"IF(Setup!I16=\"Suspension\",\"Mass samp+Pyc in H2O\",\"Mass Pyc + Mix + Water\")","v":"Mass Pyc + Mix + Water"}]
[null,"Spec. 1",null,null,null,null,null,null,null,null,null,null,null,null,null,{"$f":"IF($AI$1=\"Suspension\",ROUND(D11/(J11-F11),3),IF($AI$1=\"Volumeter\",ROUND(D11/(J11-(F11-$AG$1)),3),\" \"))","v":{"$error":"#DIV/0!"}},null,{"$f":"IF(J11,ROUND(P11/X8*100,1),\"\")","v":""},null,{"$f":"IF(J11,ROUND(100*(1-(P11/$X$8)),1),\"\")","v":""},null,{"$f":"IF(J11,ROUND(100-(P11/$AG$4)*$AG$5,1),\"\")","v":""},null,{"$f":"IF(J11,100*(V11-T11)/V11,\"\")","v":""}]
[null,"Spec. 2",null,null,null,null,null,null,null,null,null,null,null,null,null,{"$f":"IF($AI$1=\"Suspension\",ROUND(D12/(J12-F12),3),IF($AI$1=\"Volumeter\",ROUND(D12/(J12-(F12-$AG$1)),3),\" \"))","v":{"$error":"#DIV/0!"}},null,{"$f":"IF(J12,ROUND(P12/X8*100,1),\"\")","v":""},null,{"$f":"IF(J12,ROUND(100*(1-(P12/$X$8)),1),\"\")","v":""},null,{"$f":"IF(J12,ROUND(100-(P12/$AG$4)*$AG$5,1),\"\")","v":""},null,{"$f":"IF(J12,100*(V12-T12)/V12,\"\")","v":""}]
[null,"Spec. 3",null,null,null,null,null,null,null,null,null,null,null,null,null,{"$f":"IF($AI$1=\"Suspension\",ROUND(D13/(J13-F13),3),IF($AI$1=\"Volumeter\",ROUND(D13/(J13-(F13-$AG$1)),3),\" \"))","v":{"$error":"#DIV/0!"}},null,{"$f":"IF(J13,ROUND(P13/X8*100,1),\"\")","v":""},null,{"$f":"IF(J13,ROUND(100*(1-(P13/$X$8)),1),\"\")","v":""},null,{"$f":"IF(J13,ROUND(100-(P13/$AG$4)*$AG$5,1),\"\")","v":""},null,{"$f":"IF(J13,100*(V13-T13)/V13,\"\")","v":""}]
[null,null,null,null,null,null,null,null,null,null,null,null,null,null,null,null,null,null,null,{"$f":"IF(J11,ROUND(AVERAGE(T11:T13),2),\"\")","v":""},null,{"$f":"IF(J11,ROUND(AVERAGE(V11:V13),2),\"\")","v":""},null,{"$f":"IF(J11,ROUND(AVERAGE(X11:X13),2),\"\")","v":""}]
[]
[null,{"$f":"'Gmm2'!K17","v":0},null,"Asphalt Content",null,null,null,null,null,null,null,"Samp Ht.",null,null,null,"Maximum Theoretical Gravity (Gmm) =",null,null,null,null,null,null,null,{"$f":"IF($AG$2=\"Measured Gmm\",'Gmm2'!K31,'Gmm2'!M17)","v":""}]
[null,null,null,"Dry Weight",null,{"$f":"IF(Setup!$F$23=\"Suspension\",\"Mass Spec. in H2O\",\"Mass Pyc + Specimen + Water\")","v":"Mass Spec. in H2O"},null,null,null,"SSD Weight",null,"Height @ Nini",null,"Height @ Ndes",null,"Gmb",null,"% Gmm",null,"Voids",null,"VMA",null,"VFA"]
[null,null,null,null,null,{"$f":"IF(Setup!I22=\"Suspension\",\"Mass samp+Pyc in H2O\",\"Mass Pyc + Mix + Water\")","v":"Mass Pyc + Mix + Water"}]
[null,"Spec. 1",null,null,null,null,null,null,null,null,null,null,null,null,null,{"$f":"IF($AI$1=\"Suspension\",ROUND(D19/(J19-F19),3),IF($AI$1=\"Volumeter\",ROUND(D19/(J19-(F19-$AG$1)),3),\" \"))","v":{"$error":"#DIV/0!"}},null,{"$f":"IF(J19,ROUND(P19/X16*100,1),\"\")","v":""},null,{"$f":"IF(J19,ROUND(100*(1-(P19/$X$16)),1),\"\")","v":""},null,{"$f":"IF(J19,ROUND(100-(P19/$AG$4)*$AG$6,1),\"\")","v":""},null,{"$f":"IF(J19,100*(V19-T19)/V19,\"\")","v":""}]
[null,"Spec. 2",null,null,null,null,null,null,null,null,null,null,null,null,null,{"$f":"IF($AI$1=\"Suspension\",ROUND(D20/(J20-F20),3),IF($AI$1=\"Volumeter\",ROUND(D20/(J20-(F20-$AG$1)),3),\" \"))","v":{"$error":"#DIV/0!"}},null,{"$f":"IF(J20,ROUND(P20/X16*100,1),\"\")","v":""},null,{"$f":"IF(J20,ROUND(100*(1-(P20/$X$16)),1),\"\")","v":""},null,{"$f":"IF(J20,ROUND(100-(P20/$AG$4)*$AG$6,1),\"\")","v":""},null,{"$f":"IF(J20,100*(V20-T20)/V20,\"\")","v":""}]
[null,"Spec. 3",null,null,null,null,null,null,null,null,null,null,null,null,null,{"$f":"IF($AI$1=\"Suspension\",ROUND(D21/(J21-F21),3),IF($AI$1=\"Volumeter\",ROUND(D21/(J21-(F21-$AG$1)),3),\" \"))","v":{"$error":"#DIV/0!"}},null,{"$f":"IF(J21,ROUND(P21/X16*100,1),\"\")","v":""},null,{"$f":"IF(J21,ROUND(100*(1-(P21/$X$16)),1),\"\")","v":""},null,{"$f":"IF(J21,ROUND(100-(P21/$AG$4)*$AG$6,1),\"\")","v":""},null,{"$f":"IF(J21,100*(V21-T21)/V21,\"\")","v":""}]
[null,null,null,null,null,null,null,null,null,null,null,null,null,null,null,null,null,null,null,{"$f":"IF(J19,ROUND(AVERAGE(T19:T21),2),\"\")","v":""},null,{"$f":"IF(J19,ROUND(AVERAGE(V19:V21),2),\"\")","v":""},null,{"$f":"IF(J19,ROUND(AVERAGE(X19:X21),2),\"\")","v":""}]
[]
[null,{"$f":"'Gmm2'!K18","v":0.5},null,"Asphalt Content",null,null,null,null,null,null,null,"Samp Ht.",null,null,null,"Maximum Theoretical Gravity (Gmm) =",null,null,null,null,null,null,null,{"$f":"IF($AG$2=\"Measured Gmm\",'Gmm2'!O31,'Gmm2'!M18)","v":""}]
[null,null,null,"Dry Weight",null,{"$f":"IF(Setup!$F$23=\"Suspension\",\"Mass Spec. in H2O\",\"Mass Pyc + Specimen + Water\")","v":"Mass Spec. in H2O"},null,null,null,"SSD Weight",null,"Height @ Nini",null,"Height @ Ndes",null,"Gmb",null,"% Gmm",null,"Voids",null,"VMA",null,"VFA"]
[null,null,null,null,null,{"$f":"IF(Setup!I29=\"Suspension\",\"Mass samp+Pyc in H2O\",\"Mass Pyc + Mix + Water\")","v":"Mass Pyc + Mix + Water"}]
[null,"Spec. 1",null,null,null,null,null,null,null,null,null,null,null,null,null,{"$f":"IF($AI$1=\"Suspension\",ROUND(D27/(J27-F27),3),IF($AI$1=\"Volumeter\",ROUND(D27/(J27-(F27-$AG$1)),3),\" \"))","v":{"$error":"#DIV/0!"}},null,{"$f":"IF(J27,ROUND(P27/X24*100,1),\"\")","v":""},null,{"$f":"IF(J27,ROUND(100*(1-(P27/$X$24)),1),\"\")","v":""},null,{"$f":"IF(J27,ROUND(100-(P27/$AG$4)*$AG$7,1),\"\")","v":""},null,{"$f":"IF(J27,100*(V27-T27)/V27,\"\")","v":""}]
[null,"Spec. 2",null,null,null,null,null,null,null,null,null,null,null,null,null,{"$f":"IF($AI$1=\"Suspension\",ROUND(D28/(J28-F28),3),IF($AI$1=\"Volumeter\",ROUND(D28/(J28-(F28-$AG$1)),3),\" \"))","v":{"$error":"#DIV/0!"}},null,{"$f":"IF(J28,ROUND(P28/X24*100,1),\"\")","v":""},null,{"$f":"IF(J28,ROUND(100*(1-(P28/$X$24)),1),\"\")","v":""},null,{"$f":"IF(J28,ROUND(100-(P28/$AG$4)*$AG$7,1),\"\")","v":""},null,{"$f":"IF(J28,100*(V28-T28)/V28,\"\")","v":""}]
[null,"Spec. 3",null,null,null,null,null,null,null,null,null,null,null,null,null,{"$f":"IF($AI$1=\"Suspension\",ROUND(D29/(J29-F29),3),IF($AI$1=\"Volumeter\",ROUND(D29/(J29-(F29-$AG$1)),3),\" \"))","v":{"$error":"#DIV/0!"}},null,{"$f":"IF(J29,ROUND(P29/X24*100,1),\"\")","v":""},null,{"$f":"IF(J29,ROUND(100*(1-(P29/$X$24)),1),\"\")","v":""},null,{"$f":"IF(J29,ROUND(100-(P29/$AG$4)*$AG$7,1),\"\")","v":""},null,{"$f":"IF(J29,100*(V29-T29)/V29,\"\")","v":""}]
[null,null,null,null,null,null,null,null,null,null,null,null,null,null,null,null,null,null,null,{"$f":"IF(J27,ROUND(AVERAGE(T27:T29),2),\"\")","v":""},null,{"$f":"IF(J27,ROUND(AVERAGE(V27:V29),2),\"\")","v":""},null,{"$f":"IF(J27,ROUND(AVERAGE(X27:X29),2),\"\")","v":""}]
[]
[null,{"$f":"'Gmm2'!K19","v":1},null,"Asphalt Content",null,null,null,null,null,null,null,null,"Samp Ht.",null,null,"Maximum Theoretical Gravity (Gmm) =",null,null,null,null,null,null,null,{"$f":"IF($AG$2=\"Measured Gmm\",'Gmm2'!S31,'Gmm2'!M19)","v":""}]
[null,null,null,"Dry Weight",null,{"$f":"IF(Setup!$F$23=\"Suspension\",\"Mass Spec. in H2O\",\"Mass Pyc + Specimen + Water\")","v":"Mass Spec. in H2O"},null,null,null,"SSD Weight",null,"Height @ Nini",null,"Height @ Ndes",null,"Gmb",null,"% Gmm",null,"Voids",null,"VMA",null,"VFA"]
[null,null,null,null,null,{"$f":"IF(Setup!I36=\"Suspension\",\"Mass samp+Pyc in H2O\",\"Mass Pyc + Mix + Water\")","v":"Mass Pyc + Mix + Water"}]
[null,"Spec. 1",null,null,null,null,null,null,null,null,null,null,null,null,null,{"$f":"IF($AI$1=\"Suspension\",ROUND(D35/(J35-F35),3),IF($AI$1=\"Volumeter\",ROUND(D35/(J35-(F35-$AG$1)),3),\" \"))","v":{"$error":"#DIV/0!"}},null,{"$f":"IF(J35,ROUND(P35/X32*100,1),\"\")","v":""},null,{"$f":"IF(J35,ROUND(100*(1-(P35/$X$32)),1),\"\")","v":""},null,{"$f":"IF(J35,ROUND(100-(P35/$AG$4)*$AG$8,1),\"\")","v":""},null,{"$f":"IF(J35,100*(V35-T35)/V35,\"\")","v":""}]
[null,"Spec. 2",null,null,null,null,null,null,null,null,null,null,null,null,null,{"$f":"IF($AI$1=\"Suspension\",ROUND(D36/(J36-F36),3),IF($AI$1=\"Volumeter\",ROUND(D36/(J36-(F36-$AG$1)),3),\" \"))","v":{"$error":"#DIV/0!"}},null,{"$f":"IF(J36,ROUND(P36/X32*100,1),\"\")","v":""},null,{"$f":"IF(J36,ROUND(100*(1-(P36/$X$32)),1),\"\")","v":""},null,{"$f":"IF(J36,ROUND(100-(P36/$AG$4)*$AG$8,1),\"\")","v":""},null,{"$f":"IF(J36,100*(V36-T36)/V36,\"\")","v":""}]
[null,"Spec. 3",null,null,null,null,null,null,null,null,null,null,null,null,null,{"$f":"IF($AI$1=\"Suspension\",ROUND(D37/(J37-F37),3),IF($AI$1=\"Volumeter\",ROUND(D37/(J37-(F37-$AG$1)),3),\" \"))","v":{"$error":"#DIV/0!"}},null,{"$f":"IF(J37,ROUND(P37/X32*100,1),\"\")","v":""},null,{"$f":"IF(J37,ROUND(100*(1-(P37/$X$32)),1),\"\")","v":""},null,{"$f":"IF(J37,ROUND(100-(P37/$AG$4)*$AG$8,1),\"\")","v":""},null,{"$f":"IF(J37,100*(V37-T37)/V37,\"\")","v":""}]
[null,null,null,null,null,null,null,null,null,null,null,null,null,null,null,null,null,null,null,{"$f":"IF(J35,ROUND(AVERAGE(T35:T37),2),\"\")","v":""},null,{"$f":"IF(J35,ROUND(AVERAGE(V35:V37),2),\"\")","v":""},null,{"$f":"IF(J35,ROUND(AVERAGE(X35:X37),2),\"\")","v":""}]
[]
[null,null,null,"Varrying AC Results",null,null,null,null,null,null,null,null,null,null,null,null,null,null,null,"Specifications",null,null,null,null,null,null,null,null,null,null,null,null,null,null,null,null,null,{"$f":"P4","v":0}]
[null,null,null,"AC Content",null,null,null,{"$f":"B8","v":-0.5},null,null,{"$f":"B16","v":0},null,null,{"$f":"B24","v":0.5},null,null,{"$f":"B32","v":1},null,null,null,null,null,null,null,null,null,null,null,null,null,null,null,null,null,null,null,null,{"$f":"P5","v":0},null,"SP37.5","<.3",64,78,"11.5 Min",91.5,8.5]
[null,null,null,"Gmm",null,null,null,{"$f":"X8","v":""},null,null,{"$f":"X16","v":""},null,null,{"$f":"X24","v":""},null,null,{"$f":"X32","v":""},null,null,null,null,null,null,null,null,null,null,null,null,null,null,null,null,null,null,null,null,null,null,"SP37.5",".3 to <3",64,78,"11.5 Min",90.5,9.5]
[null,null,null,"Gmb@Ndes",null,null,null,{"$f":"IF(J12,(AVERAGE(P11:Q12)),\"\")","v":""},null,null,{"$f":"IF(J20,(AVERAGE(P19:Q20)),\"\")","v":""},null,null,{"$f":"IF(J28,(AVERAGE(P27:Q28)),\"\")","v":""},null,null,{"$f":"IF(J36,(AVERAGE(P35:Q36)),\"\")","v":""},null,null,null,null,null,null,null,null,null,null,null,null,null,null,null,null,null,null,null,null,{"$f":"INDEX($AR$41:$AR$278,MATCH(1,(AL40=$AN$41:$AN$278)*(AL41=AO41:AO278),0))","v":{"$error":"#N/A"}},null,"SP37.5","3 to <10",64,75,"11.5 Min",89,11]
[null,null,null,"Voids",null,null,null,{"$f":"T14","v":""},null,null,{"$f":"T22","v":""},null,null,{"$f":"T30","v":""},null,null,{"$f":"T38","v":""},null,null,{"$f":"IF(OR(Setup!$E$10=\"SMA95\",Setup!$E$10=\"SMA125\",Setup!$E$10=\"SP6.33\",Setup!$E$10=\"WM6.33\"),\"3.5 - 4.0\",4)","v":4},null,null,null,null,null,null,null,null,null,null,null,null,null,null,null,null,null,{"$f":"INDEX($AP$41:$AP$278,MATCH(1,(AL40=$AN$41:$AN$278)*($AL$41=$AO$41:$AO$278),0))","v":{"$error":"#N/A"}},null,"SP37.5","10 to <30",64,75,"11.5 Min",89,11]
[null,null,null,"VMA",null,null,null,{"$f":"V14","v":""},null,null,{"$f":"V22","v":""},null,null,{"$f":"V30","v":""},null,null,{"$f":"V38","v":""},null,null,{"$f":"AL43","v":{"$error":"#N/A"}},null,null,null,null,null,null,null,null,null,null,null,null,null,null,null,null,null,{"$f":"INDEX($AQ$41:$AQ$278,MATCH(1,(AL40=$AN$41:$AN$278)*($AL$41=$AO$41:$AO$278),0))","v":{"$error":"#N/A"}},null,"SP37.5","3 to <30",64,75,"11.5 Min",89,11]
[null,null,null,"VFA",null,null,null,{"$f":"X14","v":""},null,null,{"$f":"X22","v":""},null,null,{"$f":"X30","v":""},null,null,{"$f":"X38","v":""},null,null,{"$f":"AL44","v":{"$error":"#N/A"}},"-",null,{"$f":"AL45","v":{"$error":"#N/A"}},null,null,null,null,null,null,null,null,null,null,null,null,null,null,{"$f":"INDEX($AS$41:$AS$278,MATCH(1,(AL40=$AN$41:$AN$278)*($AL$41=$AO$41:$AO$278),0))","v":{"$error":"#N/A"}},null,"SP37.5",">30",64,75,"11.5 Min",89,11]
[null,null,null,"%Gmm@Nini",null,null,null,{"$f":"IF(J12,H43*((AVERAGE(N11:O12)/AVERAGE(L11:M12))/X8)*100,\"\")","v":""},null,null,{"$f":"IF(J20,K43*((AVERAGE(N19:O20)/AVERAGE(L19:M20))/X16)*100,\"\")","v":""},null,null,{"$f":"IF(J28,N43*((AVERAGE(N27:O28)/AVERAGE(L27:M28))/X24)*100,\"\")","v":""},null,null,{"$f":"IF(J28,Q43*((AVERAGE(N35:O36)/AVERAGE(L35:M36))/X32)*100,\"\")","v":""},null,null,null,"<",{"$f":"AL46","v":{"$error":"#N/A"}},null,null,null,null,null,null,null,null,null,null,null,null,null,null,null,{"$f":"INDEX($AT$41:$AT$278,MATCH(1,(AL40=$AN$41:$AN$278)*($AL$41=$AO$41:$AO$278),0))","v":{"$error":"#N/A"}},null,"SR37.5","<.3",64,78,"11.5 Min",91.5,8.5]
[null,null,null,"Voids@Nini",null,null,null,{"$f":"IF(J12,100-H47,\"\")","v":""},null,null,{"$f":"IF(J20,100-K47,\"\")","v":""},null,null,{"$f":"IF(J28,100-N47,\"\")","v":""},null,null,{"$f":"IF(J36,100-Q47,\"\")","v":""},null,null,null,">",{"$f":"AL47","v":{"$error":"#N/A"}},null,null,null,null,null,null,null,null,null,null,null,null,null,null,null,null,null,"SR37.5",".3 to <3",64,78,"11.5 Min",90.5,9.5]
[null,null,null,"Effective AC",null,null,null,{"$f":"IF(J12,IF($AG$2=\"Measured\",'Gmm2'!AG28,'Gmm2'!AG23),\"\")","v":""},null,null,{"$f":"IF(J20,IF($AG$2=\"Measured\",'Gmm2'!AH28,'Gmm2'!AH23),\"\")","v":""},null,null,{"$f":"IF(J28,IF($AG$2=\"Measured\",'Gmm2'!AI28,'Gmm2'!AI23),\"\")","v":""},null,null,{"$f":"IF(J36,IF($AG$2=\"Measured\",'Gmm2'!AJ28,'Gmm2'!AJ23),\"\")","v":""},null,null,null,null,null,null,null,null,null,null,null,null,null,null,null,null,null,null,null,null,null,null,"SR37.5","3 to <10",64,75,"11.5 Min",89,11]
[null,null,null,"Dust / Binder",null,null,null,{"$f":"IF(J12,ROUND('Design Agg'!$B$34/H49,1),\"\")","v":""},null,null,{"$f":"IF(J20,ROUND('Design Agg'!$B$34/K49,1),\"\")","v":""},null,null,{"$f":"IF(J28,ROUND('Design Agg'!$B$34/N49,1),\"\")","v":""},null,null,{"$f":"IF(J36,ROUND('Design Agg'!$B$34/Q49,1),\"\")","v":""},null,null,{"$f":"IF(OR(Setup!$E$10=\"SMA95\",Setup!$E$10=\"SMA125\"),\"NA\",\"0.6 - 1.2\")","v":"0.6 - 1.2"},null,null,null,null,null,null,null,null,null,null,null,null,null,null,null,null,null,null,null,"SR37.5","10 to <30",64,75,"11.5 Min",89,11]
[null,null,null,null,null,null,null,null,null,null,null,null,null,null,null,null,null,null,null,null,null,null,null,null,null,null,null,null,null,null,null,null,null,null,null,null,null,null,null,"SR37.5","3 to <30",64,75,"11.5 Min",89,11]
[{"$f":"Setup!$F$23&\" Method of Testing\"","v":"Suspension Method of Testing"},null,null,null,null,null,null,null,null,null,null,null,null,null,null,null,null,null,null,null,null,null,null,null,null,null,null,null,null,null,null,null,null,null,null,null,null,null,null,"SR37.5",">30",64,75,"11.5 Min",89,11]
[null,null,null,null,null,null,null,null,null,null,null,null,null,null,null,null,null,null,null,null,null,null,null,null,null,null,null,null,null,null,null,null,null,null,null,null,null,null,null,"SP25B","<.3",66,78,"12.5 Min",91.5,8.5]
[null,null,null,null,null,null,null,null,null,null,null,null,null,null,null,null,null,null,null,null,null,null,null,null,null,null,null,null,null,null,null,null,null,null,null,null,null,null,null,"SP25B",".3 to <3",66,78,"12.5 Min",90.5,9.5]
[null,null,null,null,null,null,null,null,null,null,null,null,null,null,null,null,null,null,null,null,null,null,null,null,null,null,null,null,null,null,null,null,null,null,null,null,null,null,null,"SP25B","3 to <10",66,75,"12.5 Min",89,11]
[null,null,null,null,null,null,null,null,null,null,null,null,null,null,null,null,null,null,null,null,null,null,null,null,null,null,null,null,null,null,null,null,null,null,null,null,null,null,null,"SP25B","10 to <30",66,75,"12.5 Min",89,11]
[null,null,null,null,null,null,null,null,null,null,null,null,null,null,null,null,null,null,null,null,null,null,null,null,null,null,null,null,null,null,null,null,null,null,null,null,null,null,null,"SP25B","3 to <30",66,75,"12.5 Min",89,11]
[null,null,null,null,null,null,null,null,null,null,null,null,null,null,null,null,null,null,null,null,null,null,null,null,null,null,null,null,null,null,null,null,null,null,null,null,null,null,null,"SP25B",">30",66,75,"12.5 Min",89,11]
[null,null,null,null,null,null,null,null,null,null,null,null,null,null,null,null,null,null,null,null,null,null,null,null,null,null,null,null,null,null,null,null,null,null,null,null,null,null,null,"SR25B","<.3",66,78,"12.5 Min",91.5,8.5]
[null,null,null,null,null,null,null,null,null,null,null,null,null,null,null,null,null,null,null,null,null,null,null,null,null,null,null,null,null,null,null,null,null,null,null,null,null,null,null,"SR25B",".3 to <3",66,78,"12.5 Min",90.5,9.5]
[null,null,null,null,null,null,null,null,null,null,null,null,null,null,null,null,null,null,null,null,null,null,null,null,null,null,null,null,null,null,null,null,null,null,null,null,null,null,null,"SR25B","3 to <10",66,75,"12.5 Min",89,11]
[null,null,null,null,null,null,null,null,null,null,null,null,null,null,null,null,null,null,null,null,null,null,null,null,null,null,null,null,null,null,null,null,null,null,null,null,null,null,null,"SR25B","10 to <30",66,75,"12.5 Min",89,11]
[null,null,null,null,null,null,null,null,null,null,null,null,null,null,null,null,null,null,null,null,null,null,null,null,null,null,null,null,null,null,null,null,null,null,null,null,null,null,null,"SR25B","3 to <30",66,75,"12.5 Min",89,11]
[null,null,null,null,null,null,null,null,null,null,null,null,null,null,null,null,null,null,null,null,null,null,null,null,null,null,null,null,null,null,null,null,null,null,null,null,null,null,null,"SR25B",">30",66,75,"12.5 Min",89,11]
[null,null,null,null,null,null,null,null,null,null,null,null,null,null,null,null,null,null,null,null,null,null,null,null,null,null,null,null,null,null,null,null,null,null,null,null,null,null,null,"SP19W","<.3",69,78,"13.5 Min",91.5,8.5]
[null,null,null,null,null,null,null,null,null,null,null,null,null,null,null,null,null,null,null,null,null,null,null,null,null,null,null,null,null,null,null,null,null,null,null,null,null,null,null,"SP19W",".3 to <3",69,78,"13.5 Min",90.5,9.5]
[null,null,null,null,null,null,null,null,null,null,null,null,null,null,null,null,null,null,null,null,null,null,null,null,null,null,null,null,null,null,null,null,null,null,null,null,null,null,null,"SP19W","3 to <10",69,75,"13.5 Min",89,11]
[null,null,null,null,null,null,null,null,null,null,null,null,null,null,null,null,null,null,null,null,null,null,null,null,null,null,null,null,null,null,null,null,null,null,null,null,null,null,null,"SP19W","10 to <30",69,75,"13.5 Min",89,11]
[null,null,null,null,null,null,null,null,null,null,null,null,null,null,null,null,null,null,null,null,null,null,null,null,null,null,null,null,null,null,null,null,null,null,null,null,null,null,null,"SP19W","3 to <30",69,75,"13.5 Min",89,11]
[null,null,null,null,null,null,null,null,null,null,null,null,null,null,null,null,null,null,null,null,null,null,null,null,null,null,null,null,null,null,null,null,null,null,null,null,null,null,null,"SP19W",">30",69,75,"13.5 Min",89,11]
[null,null,null,null,null,null,null,null,null,null,null,null,null,null,null,null,null,null,null,null,null,null,null,null,null,null,null,null,null,null,null,null,null,null,null,null,null,null,null,"SR19W","<.3",69,78,"13.5 Min",91.5,8.5]
[null,null,null,null,null,null,null,null,null,null,null,null,null,null,null,null,null,null,null,null,null,null,null,null,null,null,null,null,null,null,null,null,null,null,null,null,null,null,null,"SR19W",".3 to <3",69,78,"13.5 Min",90.5,9.5]
[null,null,null,null,null,null,null,null,null,null,null,null,null,null,null,null,null,null,null,null,null,null,null,null,null,null,null,null,null,null,null,null,null,null,null,null,null,null,null,"SR19W","3 to <10",69,75,"13.5 Min",89,11]
[null,null,null,null,null,null,null,null,null,null,null,null,null,null,null,null,null,null,null,null,null,null,null,null,null,null,null,null,null,null,null,null,null,null,null,null,null,null,null,"SR19W","10 to <30",69,75,"13.5 Min",89,11]
[null,null,null,null,null,null,null,null,null,null,null,null,null,null,null,null,null,null,null,null,null,null,null,null,null,null,null,null,null,null,null,null,null,null,null,null,null,null,null,"SR19W","3 to <30",69,75,"13.5 Min",89,11]
[null,null,null,null,null,null,null,null,null,null,null,null,null,null,null,null,null,null,null,null,null,null,null,null,null,null,null,null,null,null,null,null,null,null,null,null,null,null,null,"SR19W",">30",69,75,"13.5 Min",89,11]
[null,null,null,null,null,null,null,null,null,null,null,null,null,null,null,null,null,null,null,null,null,null,null,null,null,null,null,null,null,null,null,null,null,null,null,null,null,null,null,"SP12.5","<.3",71,78,"14.5 Min",91.5,8.5]
[null,null,null,null,null,null,null,null,null,null,null,null,null,null,null,null,null,null,null,null,null,null,null,null,null,null,null,null,null,null,null,null,null,null,null,null,null,null,null,"SP12.5",".3 to <3",71,78,"14.5 Min",90.5,9.5]
[null,null,null,null,null,null,null,null,null,null,null,null,null,null,null,null,null,null,null,null,null,null,null,null,null,null,null,null,null,null,null,null,null,null,null,null,null,null,null,"SP12.5","3 to <10",71,75,"14.5 Min",89,11]
[null,null,null,null,null,null,null,null,null,null,null,null,null,null,null,null,null,null,null,null,null,null,null,null,null,null,null,null,null,null,null,null,null,null,null,null,null,null,null,"SP12.5","10 to <30",71,75,"14.5 Min",89,11]
[null,null,null,null,null,null,null,null,null,null,null,null,null,null,null,null,null,null,null,null,null,null,null,null,null,null,null,null,null,null,null,null,null,null,null,null,null,null,null,"SP12.5","3 to <30",71,75,"14.5 Min",89,11]
[null,null,null,null,null,null,null,null,null,null,null,null,null,null,null,null,null,null,null,null,null,null,null,null,null,null,null,null,null,null,null,null,null,null,null,null,null,null,null,"SP12.5",">30",71,75,"14.5 Min",89,11]
[null,null,null,null,null,null,null,null,null,null,null,null,null,null,null,null,null,null,null,null,null,null,null,null,null,null,null,null,null,null,null,null,null,null,null,null,null,null,null,"SR12.5","<.3",71,78,"14.5 Min",91.5,8.5]
[null,null,null,null,null,null,null,null,null,null,null,null,null,null,null,null,null,null,null,null,null,null,null,null,null,null,null,null,null,null,null,null,null,null,null,null,null,null,null,"SR12.5",".3 to <3",71,78,"14.5 Min",90.5,9.5]
[null,null,null,null,null,null,null,null,null,null,null,null,null,null,null,null,null,null,null,null,null,null,null,null,null,null,null,null,null,null,null,null,null,null,null,null,null,null,null,"SR12.5","3 to <10",71,75,"14.5 Min",89,11]
[null,null,null,null,null,null,null,null,null,null,null,null,null,null,null,null,null,null,null,null,null,null,null,null,null,null,null,null,null,null,null,null,null,null,null,null,null,null,null,"SR12.5","10 to <30",71,75,"14.5 Min",89,11]
[null,null,null,null,null,null,null,null,null,null,null,null,null,null,null,null,null,null,null,null,null,null,null,null,null,null,null,null,null,null,null,null,null,null,null,null,null,null,null,"SR12.5","3 to <30",71,75,"14.5 Min",89,11]
[null,null,null,null,null,null,null,null,null,null,null,null,null,null,null,null,null,null,null,null,null,null,null,null,null,null,null,null,null,null,null,null,null,null,null,null,null,null,null,"SR12.5",">30",71,75,"14.5 Min",89,11]
[null,null,null,null,null,null,null,null,null,null,null,null,null,null,null,null,null,null,null,null,null,null,null,null,null,null,null,null,null,null,null,null,null,null,null,null,null,null,null,"SP9.5","<.3",70,78,"15.5 Min",91.5,8.5]
[null,null,null,null,null,null,null,null,null,null,null,null,null,null,null,null,null,null,null,null,null,null,null,null,null,null,null,null,null,null,null,null,null,null,null,null,null,null,null,"SP9.5",".3 to <3",65,78,"15.5 Min",90.5,9.5]
[null,null,null,null,null,null,null,null,null,null,null,null,null,null,null,null,null,null,null,null,null,null,null,null,null,null,null,null,null,null,null,null,null,null,null,null,null,null,null,"SP9.5","3 to <10",73,76,"15.5 Min",89,11]
[null,null,null,null,null,null,null,null,null,null,null,null,null,null,null,null,null,null,null,null,null,null,null,null,null,null,null,null,null,null,null,null,null,null,null,null,null,null,null,"SP9.5","10 to <30",73,76,"15.5 Min",89,11]
[null,null,null,null,null,null,null,null,null,null,null,null,null,null,null,null,null,null,null,null,null,null,null,null,null,null,null,null,null,null,null,null,null,null,null,null,null,null,null,"SP9.5","3 to <30",73,76,"15.5 Min",89,11]
[null,null,null,null,null,null,null,null,null,null,null,null,null,null,null,null,null,null,null,null,null,null,null,null,null,null,null,null,null,null,null,null,null,null,null,null,null,null,null,"SP9.5",">30",73,76,"15.5 Min",89,11]
[null,null,null,null,null,null,null,null,null,null,null,null,null,null,null,null,null,null,null,null,null,null,null,null,null,null,null,null,null,null,null,null,null,null,null,null,null,null,null,"SR9.5","<.3",70,78,"15.5 Min",91.5,8.5]
[null,null,null,null,null,null,null,null,null,null,null,null,null,null,null,null,null,null,null,null,null,null,null,null,null,null,null,null,null,null,null,null,null,null,null,null,null,null,null,"SR9.5",".3 to <3",65,78,"15.5 Min",90.5,9.5]
[null,null,null,null,null,null,null,null,null,null,null,null,null,null,null,null,null,null,null,null,null,null,null,null,null,null,null,null,null,null,null,null,null,null,null,null,null,null,null,"SR9.5","3 to <10",73,76,"15.5 Min",89,11]
[null,null,null,null,null,null,null,null,null,null,null,null,null,null,null,null,null,null,null,null,null,null,null,null,null,null,null,null,null,null,null,null,null,null,null,null,null,null,null,"SR9.5","10 to <30",73,76,"15.5 Min",89,11]
[null,null,null,null,null,null,null,null,null,null,null,null,null,null,null,null,null,null,null,null,null,null,null,null,null,null,null,null,null,null,null,null,null,null,null,null,null,null,null,"SR9.5","3 to <30",73,76,"15.5 Min",89,11]
[null,null,null,null,null,null,null,null,null,null,null,null,null,null,null,null,null,null,null,null,null,null,null,null,null,null,null,null,null,null,null,null,null,null,null,null,null,null,null,"SR9.5",">30",73,76,"15.5 Min",89,11]
[null,null,null,null,null,null,null,null,null,null,null,null,null,null,null,null,null,null,null,null,null,null,null,null,null,null,null,null,null,null,null,null,null,null,null,null,null,null,null,"SP4.75","<.3",70,78,"16.0 Min",91.5,8.5]
[null,null,null,null,null,null,null,null,null,null,null,null,null,null,null,null,null,null,null,null,null,null,null,null,null,null,null,null,null,null,null,null,null,null,null,null,null,null,null,"SP4.75",".3 to <3",65,78,"16.0 Min",90.5,9.5]
[null,null,null,null,null,null,null,null,null,null,null,null,null,null,null,null,null,null,null,null,null,null,null,null,null,null,null,null,null,null,null,null,null,null,null,null,null,null,null,"SP4.75","3 to <10",75,78,"16.0 Min",89,11]
[null,null,null,null,null,null,null,null,null,null,null,null,null,null,null,null,null,null,null,null,null,null,null,null,null,null,null,null,null,null,null,null,null,null,null,null,null,null,null,"SP4.75","10 to <30",75,78,"16.0 Min",89,11]
[null,null,null,null,null,null,null,null,null,null,null,null,null,null,null,null,null,null,null,null,null,null,null,null,null,null,null,null,null,null,null,null,null,null,null,null,null,null,null,"SP4.75","3 to <30",75,78,"16.0 Min",89,11]
[null,null,null,null,null,null,null,null,null,null,null,null,null,null,null,null,null,null,null,null,null,null,null,null,null,null,null,null,null,null,null,null,null,null,null,null,null,null,null,"SP4.75",">30",75,78,"16.0 Min",89,11]
[null,null,null,null,null,null,null,null,null,null,null,null,null,null,null,null,null,null,null,null,null,null,null,null,null,null,null,null,null,null,null,null,null,null,null,null,null,null,null,"SR4.75","<.3",70,78,"16.0 Min",91.5,8.5]
[null,null,null,null,null,null,null,null,null,null,null,null,null,null,null,null,null,null,null,null,null,null,null,null,null,null,null,null,null,null,null,null,null,null,null,null,null,null,null,"SR4.75",".3 to <3",65,78,"16.0 Min",90.5,9.5]
[null,null,null,null,null,null,null,null,null,null,null,null,null,null,null,null,null,null,null,null,null,null,null,null,null,null,null,null,null,null,null,null,null,null,null,null,null,null,null,"SR4.75","3 to <10",75,78,"16.0 Min",89,11]
[null,null,null,null,null,null,null,null,null,null,null,null,null,null,null,null,null,null,null,null,null,null,null,null,null,null,null,null,null,null,null,null,null,null,null,null,null,null,null,"SR4.75","10 to <30",75,78,"16.0 Min",89,11]
[null,null,null,null,null,null,null,null,null,null,null,null,null,null,null,null,null,null,null,null,null,null,null,null,null,null,null,null,null,null,null,null,null,null,null,null,null,null,null,"SR4.75","3 to <30",75,78,"16.0 Min",89,11]
[null,null,null,null,null,null,null,null,null,null,null,null,null,null,null,null,null,null,null,null,null,null,null,null,null,null,null,null,null,null,null,null,null,null,null,null,null,null,null,"SR4.75",">30",75,78,"16.0 Min",89,11]
[null,null,null,null,null,null,null,null,null,null,null,null,null,null,null,null,null,null,null,null,null,null,null,null,null,null,null,null,null,null,null,null,null,null,null,null,null,null,null,"SMA95","3 to <10","NA","NA","18.0 Min","NA","NA"]
[null,null,null,null,null,null,null,null,null,null,null,null,null,null,null,null,null,null,null,null,null,null,null,null,null,null,null,null,null,null,null,null,null,null,null,null,null,null,null,"SMA95","10 to <30","NA","NA","18.0 Min","NA","NA"]
[null,null,null,null,null,null,null,null,null,null,null,null,null,null,null,null,null,null,null,null,null,null,null,null,null,null,null,null,null,null,null,null,null,null,null,null,null,null,null,"SMA95","3 to <30","NA","NA","18.0 Min","NA","NA"]
[null,null,null,null,null,null,null,null,null,null,null,null,null,null,null,null,null,null,null,null,null,null,null,null,null,null,null,null,null,null,null,null,null,null,null,null,null,null,null,"SMA95","> 30","NA","NA","18.0 Min","NA","NA"]
[null,null,null,null,null,null,null,null,null,null,null,null,null,null,null,null,null,null,null,null,null,null,null,null,null,null,null,null,null,null,null,null,null,null,null,null,null,null,null,"SMA125","3 to <10","NA","NA","18.0 Min","NA","NA"]
[null,null,null,null,null,null,null,null,null,null,null,null,null,null,null,null,null,null,null,null,null,null,null,null,null,null,null,null,null,null,null,null,null,null,null,null,null,null,null,"SMA125","10 to <30","NA","NA","18.0 Min","NA","NA"]
[null,null,null,null,null,null,null,null,null,null,null,null,null,null,null,null,null,null,null,null,null,null,null,null,null,null,null,null,null,null,null,null,null,null,null,null,null,null,null,"SMA125","3 to <30","NA","NA","18.0 Min","NA","NA"]
[null,null,null,null,null,null,null,null,null,null,null,null,null,null,null,null,null,null,null,null,null,null,null,null,null,null,null,null,null,null,null,null,null,null,null,null,null,null,null,"SMA125","> 30","NA","NA","18.0 Min","NA","NA"]
[null,null,null,null,null,null,null,null,null,null,null,null,null,null,null,null,null,null,null,null,null,null,null,null,null,null,null,null,null,null,null,null,null,null,null,null,null,null,null,"SP25BC","<.3",66,78,"12.5 Min",91.5,8.5]
[null,null,null,null,null,null,null,null,null,null,null,null,null,null,null,null,null,null,null,null,null,null,null,null,null,null,null,null,null,null,null,null,null,null,null,null,null,null,null,"SP25BC",".3 to <3",66,78,"12.5 Min",90.5,9.5]
[null,null,null,null,null,null,null,null,null,null,null,null,null,null,null,null,null,null,null,null,null,null,null,null,null,null,null,null,null,null,null,null,null,null,null,null,null,null,null,"SP25BC","3 to <10",66,75,"12.5 Min",89,11]
[null,null,null,null,null,null,null,null,null,null,null,null,null,null,null,null,null,null,null,null,null,null,null,null,null,null,null,null,null,null,null,null,null,null,null,null,null,null,null,"SP25BC","10 to <30",66,75,"12.5 Min",89,11]
[null,null,null,null,null,null,null,null,null,null,null,null,null,null,null,null,null,null,null,null,null,null,null,null,null,null,null,null,null,null,null,null,null,null,null,null,null,null,null,"SP25BC","3 to <30",66,75,"12.5 Min",89,11]
[null,null,null,null,null,null,null,null,null,null,null,null,null,null,null,null,null,null,null,null,null,null,null,null,null,null,null,null,null,null,null,null,null,null,null,null,null,null,null,"SP25BC",">30",66,75,"12.5 Min",89,11]
[null,null,null,null,null,null,null,null,null,null,null,null,null,null,null,null,null,null,null,null,null,null,null,null,null,null,null,null,null,null,null,null,null,null,null,null,null,null,null,"SR25BC","<.3",66,78,"12.5 Min",91.5,8.5]
[null,null,null,null,null,null,null,null,null,null,null,null,null,null,null,null,null,null,null,null,null,null,null,null,null,null,null,null,null,null,null,null,null,null,null,null,null,null,null,"SR25BC",".3 to <3",66,78,"12.5 Min",90.5,9.5]
[null,null,null,null,null,null,null,null,null,null,null,null,null,null,null,null,null,null,null,null,null,null,null,null,null,null,null,null,null,null,null,null,null,null,null,null,null,null,null,"SR25BC","3 to <10",66,75,"12.5 Min",89,11]
[null,null,null,null,null,null,null,null,null,null,null,null,null,null,null,null,null,null,null,null,null,null,null,null,null,null,null,null,null,null,null,null,null,null,null,null,null,null,null,"SR25BC","10 to <30",66,75,"12.5 Min",89,11]
[null,null,null,null,null,null,null,null,null,null,null,null,null,null,null,null,null,null,null,null,null,null,null,null,null,null,null,null,null,null,null,null,null,null,null,null,null,null,null,"SR25BC","3 to <30",66,75,"12.5 Min",89,11]
[null,null,null,null,null,null,null,null,null,null,null,null,null,null,null,null,null,null,null,null,null,null,null,null,null,null,null,null,null,null,null,null,null,null,null,null,null,null,null,"SR25BC",">30",66,75,"12.5 Min",89,11]
[null,null,null,null,null,null,null,null,null,null,null,null,null,null,null,null,null,null,null,null,null,null,null,null,null,null,null,null,null,null,null,null,null,null,null,null,null,null,null,"SP19B","<.3",69,78,"13.5 Min",91.5,8.5]
[null,null,null,null,null,null,null,null,null,null,null,null,null,null,null,null,null,null,null,null,null,null,null,null,null,null,null,null,null,null,null,null,null,null,null,null,null,null,null,"SP19B",".3 to <3",69,78,"13.5 Min",90.5,9.5]
[null,null,null,null,null,null,null,null,null,null,null,null,null,null,null,null,null,null,null,null,null,null,null,null,null,null,null,null,null,null,null,null,null,null,null,null,null,null,null,"SP19B","3 to <10",69,75,"13.5 Min",89,11]
[null,null,null,null,null,null,null,null,null,null,null,null,null,null,null,null,null,null,null,null,null,null,null,null,null,null,null,null,null,null,null,null,null,null,null,null,null,null,null,"SP19B","10 to <30",69,75,"13.5 Min",89,11]
[null,null,null,null,null,null,null,null,null,null,null,null,null,null,null,null,null,null,null,null,null,null,null,null,null,null,null,null,null,null,null,null,null,null,null,null,null,null,null,"SP19B","3 to <30",69,75,"13.5 Min",89,11]
[null,null,null,null,null,null,null,null,null,null,null,null,null,null,null,null,null,null,null,null,null,null,null,null,null,null,null,null,null,null,null,null,null,null,null,null,null,null,null,"SP19B",">30",69,75,"13.5 Min",89,11]
[null,null,null,null,null,null,null,null,null,null,null,null,null,null,null,null,null,null,null,null,null,null,null,null,null,null,null,null,null,null,null,null,null,null,null,null,null,null,null,"SR19B","<.3",69,78,"13.5 Min",91.5,8.5]
[null,null,null,null,null,null,null,null,null,null,null,null,null,null,null,null,null,null,null,null,null,null,null,null,null,null,null,null,null,null,null,null,null,null,null,null,null,null,null,"SR19B",".3 to <3",69,78,"13.5 Min",90.5,9.5]
[null,null,null,null,null,null,null,null,null,null,null,null,null,null,null,null,null,null,null,null,null,null,null,null,null,null,null,null,null,null,null,null,null,null,null,null,null,null,null,"SR19B","3 to <10",69,75,"13.5 Min",89,11]
[null,null,null,null,null,null,null,null,null,null,null,null,null,null,null,null,null,null,null,null,null,null,null,null,null,null,null,null,null,null,null,null,null,null,null,null,null,null,null,"SR19B","10 to <30",69,75,"13.5 Min",89,11]
[null,null,null,null,null,null,null,null,null,null,null,null,null,null,null,null,null,null,null,null,null,null,null,null,null,null,null,null,null,null,null,null,null,null,null,null,null,null,null,"SR19B","3 to <30",69,75,"13.5 Min",89,11]
[null,null,null,null,null,null,null,null,null,null,null,null,null,null,null,null,null,null,null,null,null,null,null,null,null,null,null,null,null,null,null,null,null,null,null,null,null,null,null,"SR19B",">30",69,75,"13.5 Min",89,11]
[null,null,null,null,null,null,null,null,null,null,null,null,null,null,null,null,null,null,null,null,null,null,null,null,null,null,null,null,null,null,null,null,null,null,null,null,null,null,null,"WM37.5","<.3",64,78,"11.5 Min",91.5,8.5]
[null,null,null,null,null,null,null,null,null,null,null,null,null,null,null,null,null,null,null,null,null,null,null,null,null,null,null,null,null,null,null,null,null,null,null,null,null,null,null,"WM37.5",".3 to <3",64,78,"11.5 Min",90.5,9.5]
[null,null,null,null,null,null,null,null,null,null,null,null,null,null,null,null,null,null,null,null,null,null,null,null,null,null,null,null,null,null,null,null,null,null,null,null,null,null,null,"WM37.5","3 to <10",64,75,"11.5 Min",89,11]
[null,null,null,null,null,null,null,null,null,null,null,null,null,null,null,null,null,null,null,null,null,null,null,null,null,null,null,null,null,null,null,null,null,null,null,null,null,null,null,"WM37.5","10 to <30",64,75,"11.5 Min",89,11]
[null,null,null,null,null,null,null,null,null,null,null,null,null,null,null,null,null,null,null,null,null,null,null,null,null,null,null,null,null,null,null,null,null,null,null,null,null,null,null,"WM37.5","3 to <30",64,75,"11.5 Min",89,11]
[null,null,null,null,null,null,null,null,null,null,null,null,null,null,null,null,null,null,null,null,null,null,null,null,null,null,null,null,null,null,null,null,null,null,null,null,null,null,null,"WM37.5",">30",64,75,"11.5 Min",89,11]
[null,null,null,null,null,null,null,null,null,null,null,null,null,null,null,null,null,null,null,null,null,null,null,null,null,null,null,null,null,null,null,null,null,null,null,null,null,null,null,"WR37.5","<.3",64,78,"11.5 Min",91.5,8.5]
[null,null,null,null,null,null,null,null,null,null,null,null,null,null,null,null,null,null,null,null,null,null,null,null,null,null,null,null,null,null,null,null,null,null,null,null,null,null,null,"WR37.5",".3 to <3",64,78,"11.5 Min",90.5,9.5]
[null,null,null,null,null,null,null,null,null,null,null,null,null,null,null,null,null,null,null,null,null,null,null,null,null,null,null,null,null,null,null,null,null,null,null,null,null,null,null,"WR37.5","3 to <10",64,75,"11.5 Min",89,11]
[null,null,null,null,null,null,null,null,null,null,null,null,null,null,null,null,null,null,null,null,null,null,null,null,null,null,null,null,null,null,null,null,null,null,null,null,null,null,null,"WR37.5","10 to <30",64,75,"11.5 Min",89,11]
[null,null,null,null,null,null,null,null,null,null,null,null,null,null,null,null,null,null,null,null,null,null,null,null,null,null,null,null,null,null,null,null,null,null,null,null,null,null,null,"WR37.5","3 to <30",64,75,"11.5 Min",89,11]
[null,null,null,null,null,null,null,null,null,null,null,null,null,null,null,null,null,null,null,null,null,null,null,null,null,null,null,null,null,null,null,null,null,null,null,null,null,null,null,"WR37.5",">30",64,75,"11.5 Min",89,11]
[null,null,null,null,null,null,null,null,null,null,null,null,null,null,null,null,null,null,null,null,null,null,null,null,null,null,null,null,null,null,null,null,null,null,null,null,null,null,null,"WM12.5","<.3",71,78,"14.5 Min",91.5,8.5]
[null,null,null,null,null,null,null,null,null,null,null,null,null,null,null,null,null,null,null,null,null,null,null,null,null,null,null,null,null,null,null,null,null,null,null,null,null,null,null,"WM12.5",".3 to <3",71,78,"14.5 Min",90.5,9.5]
[null,null,null,null,null,null,null,null,null,null,null,null,null,null,null,null,null,null,null,null,null,null,null,null,null,null,null,null,null,null,null,null,null,null,null,null,null,null,null,"WM12.5","3 to <10",71,75,"14.5 Min",89,11]
[null,null,null,null,null,null,null,null,null,null,null,null,null,null,null,null,null,null,null,null,null,null,null,null,null,null,null,null,null,null,null,null,null,null,null,null,null,null,null,"WM12.5","10 to <30",71,75,"14.5 Min",89,11]
[null,null,null,null,null,null,null,null,null,null,null,null,null,null,null,null,null,null,null,null,null,null,null,null,null,null,null,null,null,null,null,null,null,null,null,null,null,null,null,"WM12.5","3 to <30",71,75,"14.5 Min",89,11]
[null,null,null,null,null,null,null,null,null,null,null,null,null,null,null,null,null,null,null,null,null,null,null,null,null,null,null,null,null,null,null,null,null,null,null,null,null,null,null,"WM12.5",">30",71,75,"14.5 Min",89,11]
[null,null,null,null,null,null,null,null,null,null,null,null,null,null,null,null,null,null,null,null,null,null,null,null,null,null,null,null,null,null,null,null,null,null,null,null,null,null,null,"WR12.5","<.3",71,78,"14.5 Min",91.5,8.5]
[null,null,null,null,null,null,null,null,null,null,null,null,null,null,null,null,null,null,null,null,null,null,null,null,null,null,null,null,null,null,null,null,null,null,null,null,null,null,null,"WR12.5",".3 to <3",71,78,"14.5 Min",90.5,9.5]
[null,null,null,null,null,null,null,null,null,null,null,null,null,null,null,null,null,null,null,null,null,null,null,null,null,null,null,null,null,null,null,null,null,null,null,null,null,null,null,"WR12.5","3 to <10",71,75,"14.5 Min",89,11]
[null,null,null,null,null,null,null,null,null,null,null,null,null,null,null,null,null,null,null,null,null,null,null,null,null,null,null,null,null,null,null,null,null,null,null,null,null,null,null,"WR12.5","10 to <30",71,75,"14.5 Min",89,11]
[null,null,null,null,null,null,null,null,null,null,null,null,null,null,null,null,null,null,null,null,null,null,null,null,null,null,null,null,null,null,null,null,null,null,null,null,null,null,null,"WR12.5","3 to <30",71,75,"14.5 Min",89,11]
[null,null,null,null,null,null,null,null,null,null,null,null,null,null,null,null,null,null,null,null,null,null,null,null,null,null,null,null,null,null,null,null,null,null,null,null,null,null,null,"WR12.5",">30",71,75,"14.5 Min",89,11]
[null,null,null,null,null,null,null,null,null,null,null,null,null,null,null,null,null,null,null,null,null,null,null,null,null,null,null,null,null,null,null,null,null,null,null,null,null,null,null,"WM9.5","<.3",70,78,"15.5 Min",91.5,8.5]
[null,null,null,null,null,null,null,null,null,null,null,null,null,null,null,null,null,null,null,null,null,null,null,null,null,null,null,null,null,null,null,null,null,null,null,null,null,null,null,"WM9.5",".3 to <3",65,78,"15.5 Min",90.5,9.5]
[null,null,null,null,null,null,null,null,null,null,null,null,null,null,null,null,null,null,null,null,null,null,null,null,null,null,null,null,null,null,null,null,null,null,null,null,null,null,null,"WM9.5","3 to <10",73,76,"15.5 Min",89,11]
[null,null,null,null,null,null,null,null,null,null,null,null,null,null,null,null,null,null,null,null,null,null,null,null,null,null,null,null,null,null,null,null,null,null,null,null,null,null,null,"WM9.5","10 to <30",73,76,"15.5 Min",89,11]
[null,null,null,null,null,null,null,null,null,null,null,null,null,null,null,null,null,null,null,null,null,null,null,null,null,null,null,null,null,null,null,null,null,null,null,null,null,null,null,"WM9.5","3 to <30",73,76,"15.5 Min",89,11]
[null,null,null,null,null,null,null,null,null,null,null,null,null,null,null,null,null,null,null,null,null,null,null,null,null,null,null,null,null,null,null,null,null,null,null,null,null,null,null,"WM9.5",">30",73,76,"15.5 Min",89,11]
[null,null,null,null,null,null,null,null,null,null,null,null,null,null,null,null,null,null,null,null,null,null,null,null,null,null,null,null,null,null,null,null,null,null,null,null,null,null,null,"WR9.5","<.3",70,78,"15.5 Min",91.5,8.5]
[null,null,null,null,null,null,null,null,null,null,null,null,null,null,null,null,null,null,null,null,null,null,null,null,null,null,null,null,null,null,null,null,null,null,null,null,null,null,null,"WR9.5",".3 to <3",65,78,"15.5 Min",90.5,9.5]
[null,null,null,null,null,null,null,null,null,null,null,null,null,null,null,null,null,null,null,null,null,null,null,null,null,null,null,null,null,null,null,null,null,null,null,null,null,null,null,"WR9.5","3 to <10",73,76,"15.5 Min",89,11]
[null,null,null,null,null,null,null,null,null,null,null,null,null,null,null,null,null,null,null,null,null,null,null,null,null,null,null,null,null,null,null,null,null,null,null,null,null,null,null,"WR9.5","10 to <30",73,76,"15.5 Min",89,11]
[null,null,null,null,null,null,null,null,null,null,null,null,null,null,null,null,null,null,null,null,null,null,null,null,null,null,null,null,null,null,null,null,null,null,null,null,null,null,null,"WR9.5","3 to <30",73,76,"15.5 Min",89,11]
[null,null,null,null,null,null,null,null,null,null,null,null,null,null,null,null,null,null,null,null,null,null,null,null,null,null,null,null,null,null,null,null,null,null,null,null,null,null,null,"WR9.5",">30",73,76,"15.5 Min",89,11]
[null,null,null,null,null,null,null,null,null,null,null,null,null,null,null,null,null,null,null,null,null,null,null,null,null,null,null,null,null,null,null,null,null,null,null,null,null,null,null,"WM19B","<.3",69,78,"13.5 Min",91.5,8.5]
[null,null,null,null,null,null,null,null,null,null,null,null,null,null,null,null,null,null,null,null,null,null,null,null,null,null,null,null,null,null,null,null,null,null,null,null,null,null,null,"WM19B",".3 to <3",69,78,"13.5 Min",90.5,9.5]
[null,null,null,null,null,null,null,null,null,null,null,null,null,null,null,null,null,null,null,null,null,null,null,null,null,null,null,null,null,null,null,null,null,null,null,null,null,null,null,"WM19B","3 to <10",69,75,"13.5 Min",89,11]
[null,null,null,null,null,null,null,null,null,null,null,null,null,null,null,null,null,null,null,null,null,null,null,null,null,null,null,null,null,null,null,null,null,null,null,null,null,null,null,"WM19B","10 to <30",69,75,"13.5 Min",89,11]
[null,null,null,null,null,null,null,null,null,null,null,null,null,null,null,null,null,null,null,null,null,null,null,null,null,null,null,null,null,null,null,null,null,null,null,null,null,null,null,"WM19B","3 to <30",69,75,"13.5 Min",89,11]
[null,null,null,null,null,null,null,null,null,null,null,null,null,null,null,null,null,null,null,null,null,null,null,null,null,null,null,null,null,null,null,null,null,null,null,null,null,null,null,"WM19B",">30",69,75,"13.5 Min",89,11]
[null,null,null,null,null,null,null,null,null,null,null,null,null,null,null,null,null,null,null,null,null,null,null,null,null,null,null,null,null,null,null,null,null,null,null,null,null,null,null,"WR19B","<.3",69,78,"13.5 Min",91.5,8.5]
[null,null,null,null,null,null,null,null,null,null,null,null,null,null,null,null,null,null,null,null,null,null,null,null,null,null,null,null,null,null,null,null,null,null,null,null,null,null,null,"WR19B",".3 to <3",69,78,"13.5 Min",90.5,9.5]
[null,null,null,null,null,null,null,null,null,null,null,null,null,null,null,null,null,null,null,null,null,null,null,null,null,null,null,null,null,null,null,null,null,null,null,null,null,null,null,"WR19B","3 to <10",69,75,"13.5 Min",89,11]
[null,null,null,null,null,null,null,null,null,null,null,null,null,null,null,null,null,null,null,null,null,null,null,null,null,null,null,null,null,null,null,null,null,null,null,null,null,null,null,"WR19B","10 to <30",69,75,"13.5 Min",89,11]
[null,null,null,null,null,null,null,null,null,null,null,null,null,null,null,null,null,null,null,null,null,null,null,null,null,null,null,null,null,null,null,null,null,null,null,null,null,null,null,"WR19B","3 to <30",69,75,"13.5 Min",89,11]
[null,null,null,null,null,null,null,null,null,null,null,null,null,null,null,null,null,null,null,null,null,null,null,null,null,null,null,null,null,null,null,null,null,null,null,null,null,null,null,"WR19B",">30",69,75,"13.5 Min",89,11]
[null,null,null,null,null,null,null,null,null,null,null,null,null,null,null,null,null,null,null,null,null,null,null,null,null,null,null,null,null,null,null,null,null,null,null,null,null,null,null,"WM19W","<.3",69,78,"13.5 Min",91.5,8.5]
[null,null,null,null,null,null,null,null,null,null,null,null,null,null,null,null,null,null,null,null,null,null,null,null,null,null,null,null,null,null,null,null,null,null,null,null,null,null,null,"WM19W",".3 to <3",69,78,"13.5 Min",90.5,9.5]
[null,null,null,null,null,null,null,null,null,null,null,null,null,null,null,null,null,null,null,null,null,null,null,null,null,null,null,null,null,null,null,null,null,null,null,null,null,null,null,"WM19W","3 to <10",69,75,"13.5 Min",89,11]
[null,null,null,null,null,null,null,null,null,null,null,null,null,null,null,null,null,null,null,null,null,null,null,null,null,null,null,null,null,null,null,null,null,null,null,null,null,null,null,"WM19W","10 to <30",69,75,"13.5 Min",89,11]
[null,null,null,null,null,null,null,null,null,null,null,null,null,null,null,null,null,null,null,null,null,null,null,null,null,null,null,null,null,null,null,null,null,null,null,null,null,null,null,"WM19W","3 to <30",69,75,"13.5 Min",89,11]
[null,null,null,null,null,null,null,null,null,null,null,null,null,null,null,null,null,null,null,null,null,null,null,null,null,null,null,null,null,null,null,null,null,null,null,null,null,null,null,"WM19W",">30",69,75,"13.5 Min",89,11]
[null,null,null,null,null,null,null,null,null,null,null,null,null,null,null,null,null,null,null,null,null,null,null,null,null,null,null,null,null,null,null,null,null,null,null,null,null,null,null,"WR19W","<.3",69,78,"13.5 Min",91.5,8.5]
[null,null,null,null,null,null,null,null,null,null,null,null,null,null,null,null,null,null,null,null,null,null,null,null,null,null,null,null,null,null,null,null,null,null,null,null,null,null,null,"WR19W",".3 to <3",69,78,"13.5 Min",90.5,9.5]
[null,null,null,null,null,null,null,null,null,null,null,null,null,null,null,null,null,null,null,null,null,null,null,null,null,null,null,null,null,null,null,null,null,null,null,null,null,null,null,"WR19W","3 to <10",69,75,"13.5 Min",89,11]
[null,null,null,null,null,null,null,null,null,null,null,null,null,null,null,null,null,null,null,null,null,null,null,null,null,null,null,null,null,null,null,null,null,null,null,null,null,null,null,"WR19W","10 to <30",69,75,"13.5 Min",89,11]
[null,null,null,null,null,null,null,null,null,null,null,null,null,null,null,null,null,null,null,null,null,null,null,null,null,null,null,null,null,null,null,null,null,null,null,null,null,null,null,"WR19W","3 to <30",69,75,"13.5 Min",89,11]
[null,null,null,null,null,null,null,null,null,null,null,null,null,null,null,null,null,null,null,null,null,null,null,null,null,null,null,null,null,null,null,null,null,null,null,null,null,null,null,"WR19W",">30",69,75,"13.5 Min",89,11]
[null,null,null,null,null,null,null,null,null,null,null,null,null,null,null,null,null,null,null,null,null,null,null,null,null,null,null,null,null,null,null,null,null,null,null,null,null,null,null,"WM25BC","<.3",66,78,"12.5 Min",91.5,8.5]
[null,null,null,null,null,null,null,null,null,null,null,null,null,null,null,null,null,null,null,null,null,null,null,null,null,null,null,null,null,null,null,null,null,null,null,null,null,null,null,"WM25BC",".3 to <3",66,78,"12.5 Min",90.5,9.5]
[null,null,null,null,null,null,null,null,null,null,null,null,null,null,null,null,null,null,null,null,null,null,null,null,null,null,null,null,null,null,null,null,null,null,null,null,null,null,null,"WM25BC","3 to <10",66,75,"12.5 Min",89,11]
[null,null,null,null,null,null,null,null,null,null,null,null,null,null,null,null,null,null,null,null,null,null,null,null,null,null,null,null,null,null,null,null,null,null,null,null,null,null,null,"WM25BC","10 to <30",66,75,"12.5 Min",89,11]
[null,null,null,null,null,null,null,null,null,null,null,null,null,null,null,null,null,null,null,null,null,null,null,null,null,null,null,null,null,null,null,null,null,null,null,null,null,null,null,"WM25BC","3 to <30",66,75,"12.5 Min",89,11]
[null,null,null,null,null,null,null,null,null,null,null,null,null,null,null,null,null,null,null,null,null,null,null,null,null,null,null,null,null,null,null,null,null,null,null,null,null,null,null,"WM25BC",">30",66,75,"12.5 Min",89,11]
[null,null,null,null,null,null,null,null,null,null,null,null,null,null,null,null,null,null,null,null,null,null,null,null,null,null,null,null,null,null,null,null,null,null,null,null,null,null,null,"WR25BC","<.3",66,78,"12.5 Min",91.5,8.5]
[null,null,null,null,null,null,null,null,null,null,null,null,null,null,null,null,null,null,null,null,null,null,null,null,null,null,null,null,null,null,null,null,null,null,null,null,null,null,null,"WR25BC",".3 to <3",66,78,"12.5 Min",90.5,9.5]
[null,null,null,null,null,null,null,null,null,null,null,null,null,null,null,null,null,null,null,null,null,null,null,null,null,null,null,null,null,null,null,null,null,null,null,null,null,null,null,"WR25BC","3 to <10",66,75,"12.5 Min",89,11]
[null,null,null,null,null,null,null,null,null,null,null,null,null,null,null,null,null,null,null,null,null,null,null,null,null,null,null,null,null,null,null,null,null,null,null,null,null,null,null,"WR25BC","10 to <30",66,75,"12.5 Min",89,11]
[null,null,null,null,null,null,null,null,null,null,null,null,null,null,null,null,null,null,null,null,null,null,null,null,null,null,null,null,null,null,null,null,null,null,null,null,null,null,null,"WR25BC","3 to <30",66,75,"12.5 Min",89,11]
[null,null,null,null,null,null,null,null,null,null,null,null,null,null,null,null,null,null,null,null,null,null,null,null,null,null,null,null,null,null,null,null,null,null,null,null,null,null,null,"WR25BC",">30",66,75,"12.5 Min",89,11]
[null,null,null,null,null,null,null,null,null,null,null,null,null,null,null,null,null,null,null,null,null,null,null,null,null,null,null,null,null,null,null,null,null,null,null,null,null,null,null,"WM25B","<.3",66,78,"12.5 Min",91.5,8.5]
[null,null,null,null,null,null,null,null,null,null,null,null,null,null,null,null,null,null,null,null,null,null,null,null,null,null,null,null,null,null,null,null,null,null,null,null,null,null,null,"WM25B",".3 to <3",66,78,"12.5 Min",90.5,9.5]
[null,null,null,null,null,null,null,null,null,null,null,null,null,null,null,null,null,null,null,null,null,null,null,null,null,null,null,null,null,null,null,null,null,null,null,null,null,null,null,"WM25B","3 to <10",66,75,"12.5 Min",89,11]
[null,null,null,null,null,null,null,null,null,null,null,null,null,null,null,null,null,null,null,null,null,null,null,null,null,null,null,null,null,null,null,null,null,null,null,null,null,null,null,"WM25B","10 to <30",66,75,"12.5 Min",89,11]
[null,null,null,null,null,null,null,null,null,null,null,null,null,null,null,null,null,null,null,null,null,null,null,null,null,null,null,null,null,null,null,null,null,null,null,null,null,null,null,"WM25B","3 to <30",66,75,"12.5 Min",89,11]
[null,null,null,null,null,null,null,null,null,null,null,null,null,null,null,null,null,null,null,null,null,null,null,null,null,null,null,null,null,null,null,null,null,null,null,null,null,null,null,"WM25B",">30",66,75,"12.5 Min",89,11]
[null,null,null,null,null,null,null,null,null,null,null,null,null,null,null,null,null,null,null,null,null,null,null,null,null,null,null,null,null,null,null,null,null,null,null,null,null,null,null,"WR25B","<.3",66,78,"12.5 Min",91.5,8.5]
[null,null,null,null,null,null,null,null,null,null,null,null,null,null,null,null,null,null,null,null,null,null,null,null,null,null,null,null,null,null,null,null,null,null,null,null,null,null,null,"WR25B",".3 to <3",66,78,"12.5 Min",90.5,9.5]
[null,null,null,null,null,null,null,null,null,null,null,null,null,null,null,null,null,null,null,null,null,null,null,null,null,null,null,null,null,null,null,null,null,null,null,null,null,null,null,"WR25B","3 to <10",66,75,"12.5 Min",89,11]
[null,null,null,null,null,null,null,null,null,null,null,null,null,null,null,null,null,null,null,null,null,null,null,null,null,null,null,null,null,null,null,null,null,null,null,null,null,null,null,"WR25B","10 to <30",66,75,"12.5 Min",89,11]
[null,null,null,null,null,null,null,null,null,null,null,null,null,null,null,null,null,null,null,null,null,null,null,null,null,null,null,null,null,null,null,null,null,null,null,null,null,null,null,"WR25B","3 to <30",66,75,"12.5 Min",89,11]
[null,null,null,null,null,null,null,null,null,null,null,null,null,null,null,null,null,null,null,null,null,null,null,null,null,null,null,null,null,null,null,null,null,null,null,null,null,null,null,"WR25B",">30",66,75,"12.5 Min",89,11]
[null,null,null,null,null,null,null,null,null,null,null,null,null,null,null,null,null,null,null,null,null,null,null,null,null,null,null,null,null,null,null,null,null,null,null,null,null,null,null,"SP19W / SP19B","<.3",69,78,"13.5 Min",91.5,8.5]
[null,null,null,null,null,null,null,null,null,null,null,null,null,null,null,null,null,null,null,null,null,null,null,null,null,null,null,null,null,null,null,null,null,null,null,null,null,null,null,"SP19W / SP19B",".3 to <3",69,78,"13.5 Min",90.5,9.5]
[null,null,null,null,null,null,null,null,null,null,null,null,null,null,null,null,null,null,null,null,null,null,null,null,null,null,null,null,null,null,null,null,null,null,null,null,null,null,null,"SP19W / SP19B","3 to <10",69,75,"13.5 Min",89,11]
[null,null,null,null,null,null,null,null,null,null,null,null,null,null,null,null,null,null,null,null,null,null,null,null,null,null,null,null,null,null,null,null,null,null,null,null,null,null,null,"SP19W / SP19B","10 to <30",69,75,"13.5 Min",89,11]
[null,null,null,null,null,null,null,null,null,null,null,null,null,null,null,null,null,null,null,null,null,null,null,null,null,null,null,null,null,null,null,null,null,null,null,null,null,null,null,"SP19W / SP19B","3 to <30",69,75,"13.5 Min",89,11]
[null,null,null,null,null,null,null,null,null,null,null,null,null,null,null,null,null,null,null,null,null,null,null,null,null,null,null,null,null,null,null,null,null,null,null,null,null,null,null,"SP19W / SP19B",">30",69,75,"13.5 Min",89,11]
[null,null,null,null,null,null,null,null,null,null,null,null,null,null,null,null,null,null,null,null,null,null,null,null,null,null,null,null,null,null,null,null,null,null,null,null,null,null,null,"SR19W / SR19B","<.3",69,78,"13.5 Min",91.5,8.5]
[null,null,null,null,null,null,null,null,null,null,null,null,null,null,null,null,null,null,null,null,null,null,null,null,null,null,null,null,null,null,null,null,null,null,null,null,null,null,null,"SR19W / SR19B",".3 to <3",69,78,"13.5 Min",90.5,9.5]
[null,null,null,null,null,null,null,null,null,null,null,null,null,null,null,null,null,null,null,null,null,null,null,null,null,null,null,null,null,null,null,null,null,null,null,null,null,null,null,"SR19W / SR19B","3 to <10",69,75,"13.5 Min",89,11]
[null,null,null,null,null,null,null,null,null,null,null,null,null,null,null,null,null,null,null,null,null,null,null,null,null,null,null,null,null,null,null,null,null,null,null,null,null,null,null,"SR19W / SR19B","10 to <30",69,75,"13.5 Min",89,11]
[null,null,null,null,null,null,null,null,null,null,null,null,null,null,null,null,null,null,null,null,null,null,null,null,null,null,null,null,null,null,null,null,null,null,null,null,null,null,null,"SR19W / SR19B","3 to <30",69,75,"13.5 Min",89,11]
[null,null,null,null,null,null,null,null,null,null,null,null,null,null,null,null,null,null,null,null,null,null,null,null,null,null,null,null,null,null,null,null,null,null,null,null,null,null,null,"SR19W / SR19B",">30",69,75,"13.5 Min",89,11]
[null,null,null,null,null,null,null,null,null,null,null,null,null,null,null,null,null,null,null,null,null,null,null,null,null,null,null,null,null,null,null,null,null,null,null,null,null,null,null,"SP25B / SP25BC","<.3",66,78,"12.5 Min",91.5,8.5]
[null,null,null,null,null,null,null,null,null,null,null,null,null,null,null,null,null,null,null,null,null,null,null,null,null,null,null,null,null,null,null,null,null,null,null,null,null,null,null,"SP25B / SP25BC",".3 to <3",66,78,"12.5 Min",90.5,9.5]
[null,null,null,null,null,null,null,null,null,null,null,null,null,null,null,null,null,null,null,null,null,null,null,null,null,null,null,null,null,null,null,null,null,null,null,null,null,null,null,"SP25B / SP25BC","3 to <10",66,75,"12.5 Min",89,11]
[null,null,null,null,null,null,null,null,null,null,null,null,null,null,null,null,null,null,null,null,null,null,null,null,null,null,null,null,null,null,null,null,null,null,null,null,null,null,null,"SP25B / SP25BC","10 to <30",66,75,"12.5 Min",89,11]
[null,null,null,null,null,null,null,null,null,null,null,null,null,null,null,null,null,null,null,null,null,null,null,null,null,null,null,null,null,null,null,null,null,null,null,null,null,null,null,"SP25B / SP25BC","3 to <30",66,75,"12.5 Min",89,11]
[null,null,null,null,null,null,null,null,null,null,null,null,null,null,null,null,null,null,null,null,null,null,null,null,null,null,null,null,null,null,null,null,null,null,null,null,null,null,null,"SP25B / SP25BC",">30",66,75,"12.5 Min",89,11]
[null,null,null,null,null,null,null,null,null,null,null,null,null,null,null,null,null,null,null,null,null,null,null,null,null,null,null,null,null,null,null,null,null,null,null,null,null,null,null,"SR25B / SR25BC","<.3",66,78,"12.5 Min",91.5,8.5]
[null,null,null,null,null,null,null,null,null,null,null,null,null,null,null,null,null,null,null,null,null,null,null,null,null,null,null,null,null,null,null,null,null,null,null,null,null,null,null,"SR25B / SR25BC",".3 to <3",66,78,"12.5 Min",90.5,9.5]
[null,null,null,null,null,null,null,null,null,null,null,null,null,null,null,null,null,null,null,null,null,null,null,null,null,null,null,null,null,null,null,null,null,null,null,null,null,null,null,"SR25B / SR25BC","3 to <10",66,75,"12.5 Min",89,11]
[null,null,null,null,null,null,null,null,null,null,null,null,null,null,null,null,null,null,null,null,null,null,null,null,null,null,null,null,null,null,null,null,null,null,null,null,null,null,null,"SR25B / SR25BC","10 to <30",66,75,"12.5 Min",89,11]
[null,null,null,null,null,null,null,null,null,null,null,null,null,null,null,null,null,null,null,null,null,null,null,null,null,null,null,null,null,null,null,null,null,null,null,null,null,null,null,"SR25B / SR25BC","3 to <30",66,75,"12.5 Min",89,11]
[null,null,null,null,null,null,null,null,null,null,null,null,null,null,null,null,null,null,null,null,null,null,null,null,null,null,null,null,null,null,null,null,null,null,null,null,null,null,null,"SR25B / SR25BC",">30",66,75,"12.5 Min",89,11]
[null,null,null,null,null,null,null,null,null,null,null,null,null,null,null,null,null,null,null,null,null,null,null,null,null,null,null,null,null,null,null,null,null,null,null,null,null,null,null,"WM19W / WM19B","<.3",69,78,"13.5 Min",91.5,8.5]
[null,null,null,null,null,null,null,null,null,null,null,null,null,null,null,null,null,null,null,null,null,null,null,null,null,null,null,null,null,null,null,null,null,null,null,null,null,null,null,"WM19W / WM19B",".3 to <3",69,78,"13.5 Min",90.5,9.5]
[null,null,null,null,null,null,null,null,null,null,null,null,null,null,null,null,null,null,null,null,null,null,null,null,null,null,null,null,null,null,null,null,null,null,null,null,null,null,null,"WM19W / WM19B","3 to <10",69,75,"13.5 Min",89,11]
[null,null,null,null,null,null,null,null,null,null,null,null,null,null,null,null,null,null,null,null,null,null,null,null,null,null,null,null,null,null,null,null,null,null,null,null,null,null,null,"WM19W / WM19B","10 to <30",69,75,"13.5 Min",89,11]
[null,null,null,null,null,null,null,null,null,null,null,null,null,null,null,null,null,null,null,null,null,null,null,null,null,null,null,null,null,null,null,null,null,null,null,null,null,null,null,"WM19W / WM19B","3 to <30",69,75,"13.5 Min",89,11]
[null,null,null,null,null,null,null,null,null,null,null,null,null,null,null,null,null,null,null,null,null,null,null,null,null,null,null,null,null,null,null,null,null,null,null,null,null,null,null,"WM19W / WM19B",">30",69,75,"13.5 Min",89,11]
[null,null,null,null,null,null,null,null,null,null,null,null,null,null,null,null,null,null,null,null,null,null,null,null,null,null,null,null,null,null,null,null,null,null,null,null,null,null,null,"WR19W /WR19B","<.3",69,78,"13.5 Min",91.5,8.5]
[null,null,null,null,null,null,null,null,null,null,null,null,null,null,null,null,null,null,null,null,null,null,null,null,null,null,null,null,null,null,null,null,null,null,null,null,null,null,null,"WR19W /WR19B",".3 to <3",69,78,"13.5 Min",90.5,9.5]
[null,null,null,null,null,null,null,null,null,null,null,null,null,null,null,null,null,null,null,null,null,null,null,null,null,null,null,null,null,null,null,null,null,null,null,null,null,null,null,"WR19W /WR19B","3 to <10",69,75,"13.5 Min",89,11]
[null,null,null,null,null,null,null,null,null,null,null,null,null,null,null,null,null,null,null,null,null,null,null,null,null,null,null,null,null,null,null,null,null,null,null,null,null,null,null,"WR19W /WR19B","10 to <30",69,75,"13.5 Min",89,11]
[null,null,null,null,null,null,null,null,null,null,null,null,null,null,null,null,null,null,null,null,null,null,null,null,null,null,null,null,null,null,null,null,null,null,null,null,null,null,null,"WR19W /WR19B","3 to <30",69,75,"13.5 Min",89,11]
[null,null,null,null,null,null,null,null,null,null,null,null,null,null,null,null,null,null,null,null,null,null,null,null,null,null,null,null,null,null,null,null,null,null,null,null,null,null,null,"WR19W /WR19B",">30",69,75,"13.5 Min",89,11]
[null,null,null,null,null,null,null,null,null,null,null,null,null,null,null,null,null,null,null,null,null,null,null,null,null,null,null,null,null,null,null,null,null,null,null,null,null,null,null,"WM25B / WM25BC","<.3",66,78,"12.5 Min",91.5,8.5]
[null,null,null,null,null,null,null,null,null,null,null,null,null,null,null,null,null,null,null,null,null,null,null,null,null,null,null,null,null,null,null,null,null,null,null,null,null,null,null,"WM25B / WM25BC",".3 to <3",66,78,"12.5 Min",90.5,9.5]
[null,null,null,null,null,null,null,null,null,null,null,null,null,null,null,null,null,null,null,null,null,null,null,null,null,null,null,null,null,null,null,null,null,null,null,null,null,null,null,"WM25B / WM25BC","3 to <10",66,75,"12.5 Min",89,11]
[null,null,null,null,null,null,null,null,null,null,null,null,null,null,null,null,null,null,null,null,null,null,null,null,null,null,null,null,null,null,null,null,null,null,null,null,null,null,null,"WM25B / WM25BC","10 to <30",66,75,"12.5 Min",89,11]
[null,null,null,null,null,null,null,null,null,null,null,null,null,null,null,null,null,null,null,null,null,null,null,null,null,null,null,null,null,null,null,null,null,null,null,null,null,null,null,"WM25B / WM25BC","3 to <30",66,75,"12.5 Min",89,11]
[null,null,null,null,null,null,null,null,null,null,null,null,null,null,null,null,null,null,null,null,null,null,null,null,null,null,null,null,null,null,null,null,null,null,null,null,null,null,null,"WM25B / WM25BC",">30",66,75,"12.5 Min",89,11]
[null,null,null,null,null,null,null,null,null,null,null,null,null,null,null,null,null,null,null,null,null,null,null,null,null,null,null,null,null,null,null,null,null,null,null,null,null,null,null,"WR25B / WR25BC","<.3",66,78,"12.5 Min",91.5,8.5]
[null,null,null,null,null,null,null,null,null,null,null,null,null,null,null,null,null,null,null,null,null,null,null,null,null,null,null,null,null,null,null,null,null,null,null,null,null,null,null,"WR25B / WR25BC",".3 to <3",66,78,"12.5 Min",90.5,9.5]
[null,null,null,null,null,null,null,null,null,null,null,null,null,null,null,null,null,null,null,null,null,null,null,null,null,null,null,null,null,null,null,null,null,null,null,null,null,null,null,"WR25B / WR25BC","3 to <10",66,75,"12.5 Min",89,11]
[null,null,null,null,null,null,null,null,null,null,null,null,null,null,null,null,null,null,null,null,null,null,null,null,null,null,null,null,null,null,null,null,null,null,null,null,null,null,null,"WR25B / WR25BC","10 to <30",66,75,"12.5 Min",89,11]
[null,null,null,null,null,null,null,null,null,null,null,null,null,null,null,null,null,null,null,null,null,null,null,null,null,null,null,null,null,null,null,null,null,null,null,null,null,null,null,"WR25B / WR25BC","3 to <30",66,75,"12.5 Min",89,11]
[null,null,null,null,null,null,null,null,null,null,null,null,null,null,null,null,null,null,null,null,null,null,null,null,null,null,null,null,null,null,null,null,null,null,null,null,null,null,null,"WR25B / WR25BC",">30",66,75,"12.5 Min",89,11]
[null,null,null,null,null,null,null,null,null,null,null,null,null,null,null,null,null,null,null,null,null,null,null,null,null,null,null,null,null,null,null,null,null,null,null,null,null,null,null,"SP6.33",".3 to <3",75,81,"16.5 Min",90.5,9.5]
[null,null,null,null,null,null,null,null,null,null,null,null,null,null,null,null,null,null,null,null,null,null,null,null,null,null,null,null,null,null,null,null,null,null,null,null,null,null,null,"WM6.33",".3 to <3",75,81,"16.5 Min",90.5,9.5]

{"sheet":"AC Charts","index":10,"n_rows":16,"n_cols":36,"rows_kept":16,"cut":false,"hidden":false,"merged":[[4,15,4,17],[4,20,4,21],[7,10,7,14],[7,16,7,24],[4,22,4,23],[0,1,0,2],[3,2,3,4],[3,5,3,8],[3,9,3,14],[2,1,2,24],[3,19,3,21],[3,22,3,23],[3,15,3,18],[4,2,4,4],[13,29,13,31],[14,29,14,31],[15,29,15,31],[7,29,7,31],[8,29,8,31],[9,29,9,31],[11,29,11,31],[12,29,12,31],[5,2,5,4],[5,5,5,7],[5,9,5,14],[5,15,5,17],[5,19,5,21],[4,5,4,8],[4,9,4,14],[3,29,3,31],[4,29,4,31],[5,29,5,31],[6,29,6,31],[5,22,5,23]]}
[null,{"$f":"Setup!A2","v":"ESB-19"}]
[]
[null,"Varying Asphalt Content Charts"]
[null,null,"Producer;",null,null,{"$f":"Setup!E7","v":0},null,null,null,"Material Class:",null,null,null,null,null,{"$f":"Setup!E10","v":0},null,null,null,"Nominal Size:",null,null,{"$f":"Setup!E9","v":0},null,null,null,null,null,null,"AC Content",null,null,{"$f":"'AC Trials'!H41","v":-0.5},{"$f":"'AC Trials'!K41","v":0},{"$f":"'AC Trials'!N41","v":0.5},{"$f":"'AC Trials'!Q41","v":1}]
[null,null,"Designed By:",null,null,{"$f":"Setup!E8","v":0},null,null,null,"Esals:",null,null,null,null,null,{"$f":"Setup!E12","v":0},null,null,null,null,"SRL:",null,{"$f":"Setup!E11","v":0},null,null,null,null,null,null,"Gmb @ Ndes",null,null,{"$f":"'AC Trials'!H43","v":""},{"$f":"'AC Trials'!K43","v":""},{"$f":"'AC Trials'!N43","v":""},{"$f":"'AC Trials'!Q43","v":""}]
[null,null,"Date:",null,null,{"$f":"Setup!E6","v":"00:00:00"},null,null,null,"Rap:",null,null,null,null,null,{"$f":"Setup!E17","v":0},null,null,null,"PG Grade:",null,null,{"$f":"Setup!E14","v":0},null,null,null,null,null,null,"Voids @ Ndes",null,null,{"$f":"'AC Trials'!H44","v":""},{"$f":"'AC Trials'!K44","v":""},{"$f":"'AC Trials'!N44","v":""},{"$f":"'AC Trials'!Q44","v":""}]
[null,null,null,null,null,null,null,null,null,null,null,null,null,null,null,null,null,null,null,null,null,null,null,null,null,null,null,null,null,"Voids @ Nini",null,null,{"$f":"'AC Trials'!H48","v":""},{"$f":"'AC Trials'!K48","v":""},{"$f":"'AC Trials'!N48","v":""},{"$f":"'AC Trials'!Q48","v":""}]
[null,null,null,null,null,null,null,null,null,null,"Varying AC Charts",null,null,null,null,null,"Click on sheet to set up charts",null,null,null,null,null,null,null,null,null,null,null,null,"Vma",null,null,{"$f":"'AC Trials'!H45","v":""},{"$f":"'AC Trials'!K45","v":""},{"$f":"'AC Trials'!N45","v":""},{"$f":"'AC Trials'!Q45","v":""}]
[null,null,null,null,null,null,null,null,null,null,null,null,null,null,null,null,null,null,null,null,null,null,null,null,null,null,null,null,null,"VFA",null,null,{"$f":"'AC Trials'!H46","v":""},{"$f":"'AC Trials'!K46","v":""},{"$f":"'AC Trials'!N46","v":""},{"$f":"'AC Trials'!Q46","v":""}]
[null,null,null,null,null,null,null,null,null,null,null,null,null,null,null,null,null,null,null,null,null,null,null,null,null,null,null,null,null,"D/A",null,null,{"$f":"'AC Trials'!H50","v":""},{"$f":"'AC Trials'!K50","v":""},{"$f":"'AC Trials'!N50","v":""},{"$f":"'AC Trials'!Q50","v":""}]
[null,null,null,null,null,null,null,null,null,null,null,null,null,null,null,null,null,null,null,null,null,null,null,null,null,null,null,null,null,null,null,null,"Max","Min"]
[null,null,null,null,null,null,null,null,null,null,null,null,null,null,null,null,null,null,null,null,null,null,null,null,null,null,null,null,null,"Gmb",null,null,{"$f":"MIN(AG5:AJ5)-0.01","v":-0.01},{"$f":"MAX(AG5:AJ5)+0.01","v":0.01}]
[null,null,null,null,null,null,null,null,null,null,null,null,null,null,null,null,null,null,null,null,null,null,null,null,null,null,null,null,null,"Voids @ Ndes",null,null,{"$f":"MIN(AG6:AJ6)-1","v":-1},{"$f":"MAX(AG6:AJ6)+1","v":1}]
[null,null,null,null,null,null,null,null,null,null,null,null,null,null,null,null,null,null,null,null,null,null,null,null,null,null,null,null,null,"Voids @ Nini",null,null,{"$f":"MIN(AG7:AJ7)-1","v":-1},{"$f":"MAX(AG7:AJ7)+1","v":1}]
[null,null,null,null,null,null,null,null,null,null,null,null,null,null,null,null,null,null,null,null,null,null,null,null,null,null,null,null,null,"VMA",null,null,{"$f":"MIN(AG8:AJ8)-1.5","v":-1.5},{"$f":"MAX(AG8:AJ8)+1.5","v":1.5}]
[null,null,null,null,null,null,null,null,null,null,null,null,null,null,null,null,null,null,null,null,null,null,null,null,null,null,null,null,null,"VFA",null,null,{"$f":"5*ROUND(MIN(AG9:AJ9)/5-1,0)","v":-5},{"$f":"5*ROUND(MAX(AE9:AJ9)/5+1,0)","v":5}]

{"sheet":"Nmax","index":11,"n_rows":24,"n_cols":36,"rows_kept":24,"cut":false,"hidden":false,"merged":[[23,7,23,8],[7,4,7,19],[9,0,9,25],[22,11,22,12],[21,11,21,12],[23,9,23,10],[22,9,22,10],[21,9,21,10],[19,9,19,16],[20,9,20,10],[20,11,20,12],[20,13,20,14],[20,15,20,16],[23,15,23,16],[22,15,22,16],[21,15,21,16],[23,13,23,14],[22,13,22,14],[21,13,21,14],[23,11,23,12],[15,23,15,24],[15,13,15,14],[15,15,15,16],[15,17,15,18],[15,19,15,20],[15,21,15,22],[16,5,17,8],[16,19,16,20],[16,21,16,22],[16,23,16,24],[16,17,16,18],[15,1,15,2],[15,3,15,4],[15,5,15,8],[15,9,15,10],[15,11,15,12],[12,23,13,24],[14,1,14,2],[14,3,14,4],[14,5,14,8],[14,9,14,10],[14,11,14,12],[14,13,14,14],[14,15,14,16],[14,17,14,18],[14,19,14,20],[14,21,14,22],[14,23,14,24],[12,13,13,14],[12,15,13,16],[12,17,13,18],[12,19,13,20],[12,21,13,22],[12,1,13,2],[12,3,13,4],[12,5,13,8],[12,9,13,10],[12,11,13,12],[11,1,11,2],[11,3,11,10],[11,23,11,24],[11,17,11,22],[11,11,11,16],[7,20,7,21],[5,2,5,4],[5,5,5,7],[5,9,5,14],[5,15,5,17],[5,19,5,21],[5,22,5,23],[4,2,4,4],[4,5,4,8],[4,9,4,14],[4,15,4,17],[4,20,4,21],[4,22,4,23],[0,1,0,2],[2,1,2,24],[3,2,3,4],[3,5,3,8],[3,9,3,14],[3,19,3,21],[3,22,3,23],[3,15,3,18]]}
[null,{"$f":"Setup!A2","v":"ESB-19"},null,null,null,null,null,null,null,null,null,null,null,null,null,null,null,null,null,null,null,null,null,null,null,null,null,null,null,{"$f":"Setup!F23","v":"Suspension"},null,"Vol Cal.",{"$f":"Setup!F20","v":0}]
[null,null,null,null,null,null,null,null,null,null,null,null,null,null,null,null,null,null,null,null,null,null,null,null,null,null,null,null,null,{"$f":"Setup!F24","v":0},null,"GsbNdes",{"$f":"'Design Agg'!Y22","v":""},null,{"$f":"'Trial Blends'!N42","v":1},"TB selected"]
[null,"Optimum Asphalt Content Compacted to Nmax",null,null,null,null,null,null,null,null,null,null,null,null,null,null,null,null,null,null,null,null,null,null,null,null,null,null,null,null,null,"Esals",{"$f":"Setup!E12","v":0},null,{"$f":"IF(AI2=1,'Agg Blends'!K35,IF(AI2=2,'Agg Blends'!L35,IF(AI2=3,'Agg Blends'!M35)))","v":""},"TB Gsb"]
[null,null,"Producer;",null,null,{"$f":"Setup!E7","v":0},null,null,null,"Material Class:",null,null,null,null,null,{"$f":"Setup!E10","v":0},null,null,null,"Nominal Size:",null,null,{"$f":"Setup!E9","v":0}]
[null,null,"Designed By:",null,null,{"$f":"Setup!E8","v":0},null,null,null,"Esals:",null,null,null,null,null,{"$f":"Setup!E12","v":0},null,null,null,null,"SRL:",null,{"$f":"Setup!E11","v":0}]
[null,null,"Date:",null,null,{"$f":"Setup!E6","v":"00:00:00"},null,null,null,"Rap:",null,null,null,null,null,{"$f":"Setup!E17","v":0},null,null,null,"PG Grade:",null,null,{"$f":"Setup!E14","v":0}]
[]
[null,null,null,null,"Based on the AC charts, the optimum asphalt @ 4.0% air voids at Ndes will be"]
[]
["Specimens compacted to Nmax",null,null,null,null,null,null,null,null,null,null,null,null,null,null,null,null,null,null,null,null,null,null,null,null,null,null,null,null,null,null,null,{"$f":"IF($AG$3=\"<.3\",6,IF($AG$3=\".3 to <3\",7,8))","v":8}]
[null,null,null,null,null,null,null,null,null,null,null,null,null,null,null,null,null,null,null,null,null,null,null,null,null,null,null,null,null,null,null,null,{"$f":"IF($AG$3=\"<.3\",50,IF($AG$3=\".3 to <3\",75,100))","v":100}]
[null,{"$f":"U8","v":0},null,"Asphalt Content",null,null,null,null,null,null,null,"Samp Ht.",null,null,null,null,null,"Maximum Theoretical Gravity",null,null,null,null,null,null,null,null,null,null,null,null,null,null,{"$f":"IF($AG$3=\"<.3\",75,IF($AG$3=\".3 to <3\",115,160))","v":160}]
[null,null,null,"Dry Weight",null,{"$f":"IF(Setup!$F$19=\"Suspension\",\"Mass Spec. in H2O\",\"Mass Pyc + Specimen + Water\")","v":"Mass Spec. in H2O"},null,null,null,"SSD Weight",null,"Height @ Nini",null,"Height @ Ndes",null,"Height @ Nmax",null,"Gmb @ Nmax",null,"%Gmm @ Nini",null,"%Gmm @ Ndes",null,"%Gmm @ Nmax"]
[null,null,null,null,null,{"$f":"IF(Setup!#REF!=\"Suspension\",\"Mass samp+Pyc in H2O\",\"Mass Pyc + Mix + Water\")","v":{"$error":"#REF!"}}]
[null,"Spec. 1",null,null,null,null,null,null,null,null,null,null,null,null,null,null,null,{"$f":"IF($AD$1=\"Suspension\",ROUND(D15/(J15-F15),3),IF($AD$1=\"Volumeter\",ROUND(D15/(J15-(F15-$AD$2)),3),\" \"))","v":{"$error":"#DIV/0!"}},null,{"$f":"IF(D15,ROUND(P15/L15*X15,1),\" \")","v":" "},null,{"$f":"IF(D15,ROUND(P15/N15*X15,1),\" \")","v":" "},null,{"$f":"IF(D15,R15/$X$12*100,\" \")","v":" "}]
[null,"Spec. 2",null,null,null,null,null,null,null,null,null,null,null,null,null,null,null,{"$f":"IF($AD$1=\"Suspension\",ROUND(D16/(J16-F16),3),IF($AD$1=\"Volumeter\",ROUND(D16/(J16-(F16-$AD$2)),3),\" \"))","v":{"$error":"#DIV/0!"}},null,{"$f":"IF(D16,ROUND(P16/L16*X16,1),\" \")","v":" "},null,{"$f":"IF(D16,ROUND(P16/N16*X16,1),\" \")","v":" "},null,{"$f":"IF(D16,R16/$X$12*100,\" \")","v":" "}]
[null,null,null,null,null,null,null,null,null,null,null,null,null,null,null,null,null,{"$f":"IF(D15,ROUND(AVERAGE(R15:S16),3),\"\")","v":""},null,{"$f":"IF(J15,ROUND(AVERAGE(T15:T16),2),\"\")","v":""},null,{"$f":"IF(J15,ROUND(AVERAGE(V15:V16),2),\"\")","v":""},null,{"$f":"IF(J15,ROUND(AVERAGE(X15:X16),2),\"\")","v":""}]
[null,null,null,null,null,null,null,null,null,null,null,null,null,null,null,null,null,null,null,null,null,null,null,null,null,null,null,null,{"$f":"T17","v":""},null,{"$f":"IF($AG$3=\"<.3\",91.5,IF($AG$3=\"0.3 to <3\",90.5,89))","v":89},96,98]
[null,null,null,null,null,null,null,null,null,null,null,null,null,null,null,null,null,null,null,null,null,null,null,null,null,null,null,null,{"$f":"V17","v":""},null,{"$f":"IF($AG$3=\"<.3\",91.5,IF($AG$3=\"0.3 to <3\",90.5,89))","v":89},96,98]
[null,null,null,null,null,null,null,null,null,"Properties Calculated @ Ndes",null,null,null,null,null,null,null,null,null,null,null,null,null,null,null,null,null,null,{"$f":"X17","v":""},null,89,96,98]
[null,null,null,null,null,null,null,null,null,"Voids",null,"Gmb",null,"VMA",null,"VFA",null,null,null,null,null,null,null,null,null,null,null,null,null,null,89,96,98]
[null,null,null,null,null,null,null,null,null,{"$f":"IF(D15,100-V15,\" \")","v":" "},null,{"$f":"IF(D15,ROUND(X12*V15/100,3),\" \")","v":" "},null,{"$f":"IF(D15,100-((L22*(100-B12))/AI3),\"\")","v":""},null,{"$f":"IF(D15,(N22-J22)/N22*100,\" \")","v":" "},null,null,null,null,null,null,null,null,null,null,null,null,null,null,89,96,98]
[null,null,null,null,null,null,null,null,null,{"$f":"IF(D16,100-V16,\" \")","v":" "},null,{"$f":"IF(D16,ROUND(X12*V16/100,3),\" \")","v":" "},null,{"$f":"IF(D16,100-((L23*(100-B12))/AI3),\"\")","v":""},null,{"$f":"IF(D16,(N23-J23)/N23*100,\" \")","v":" "},null,null,null,null,null,null,null,null,null,null,null,null,null,null,89,96,98]
[null,null,null,null,null,null,null,"Avg.",null,{"$f":"IF(ISTEXT(J22),\"\",AVERAGE(J22:K23))","v":""},null,{"$f":"IF(ISTEXT(L22),\"\",AVERAGE(L22:M23))","v":""},null,{"$f":"IF(ISTEXT(N22),\"\",AVERAGE(N22:O23))","v":""},null,{"$f":"IF(ISTEXT(P22),\"\",AVERAGE(P22:Q23))","v":""}]

{"sheet":"Drain Down","index":12,"n_rows":27,"n_cols":23,"rows_kept":27,"cut":false,"hidden":false,"merged":[[4,15,4,17],[4,20,4,21],[4,22,4,23],[0,1,0,2],[5,2,5,4],[5,5,5,7],[5,9,5,14],[5,15,5,17],[2,1,2,24],[3,2,3,4],[3,5,3,8],[3,9,3,14],[3,15,3,18],[3,19,3,21],[3,22,3,23],[5,19,5,21],[5,22,5,23],[4,2,4,4],[4,5,4,8],[4,9,4,14],[10,16,10,17],[10,14,10,15],[16,9,16,13],[16,14,16,17],[15,16,15,17],[15,14,15,15],[14,16,14,17],[14,14,14,15],[13,16,13,17],[13,14,13,15],[21,16,21,17],[12,16,12,17],[12,14,12,15],[11,16,11,17],[11,14,11,15],[25,14,25,15],[25,16,25,17],[26,9,26,13],[26,14,26,17],[7,1,7,24],[22,14,22,15],[22,16,22,17],[23,14,23,15],[23,16,23,17],[24,14,24,15],[24,16,24,17],[9,9,9,17],[19,9,19,17],[20,14,20,15],[20,16,20,17],[21,14,21,15]]}
[null,{"$f":"Setup!A2","v":"ESB-19"}]
[]
[null,"Draindown AASHTO T305"]
[null,null,"Producer;",null,null,{"$f":"Setup!E7","v":0},null,null,null,"Material Class:",null,null,null,null,null,{"$f":"Setup!E10","v":0},null,null,null,"Nominal Size:",null,null,{"$f":"Setup!E9","v":0}]
[null,null,"Designed By:",null,null,{"$f":"Setup!E8","v":0},null,null,null,"Esals:",null,null,null,null,null,{"$f":"Setup!E12","v":0},null,null,null,null,"SRL:",null,{"$f":"Setup!E11","v":0}]
[null,null,"Date:",null,null,{"$f":"Setup!E6","v":"00:00:00"},null,null,null,"Rap:",null,null,null,null,null,{"$f":"Setup!E17","v":0},null,null,null,"PG Grade:",null,null,{"$f":"Setup!E14","v":0}]
[]
[null,"AASHTO T305 is to be determine for 6.33mm mixes with greater than 7.0% asphalt content and all SMA mixes"]
[]
[null,null,null,null,null,null,null,null,null,"Anticipated Plant Production Temperature"]
[null,null,null,null,null,null,null,null,null,"Sample No.",null,null,null,null,1,null,2]
[null,null,null,null,null,null,null,null,null,"Temperature of Sample"]
[null,null,null,null,null,null,null,null,null,"Initial Wt of Sample"]
[null,null,null,null,null,null,null,null,null,"Wt. of sample after 1 hour"]
[null,null,null,null,null,null,null,null,null,"Wt. of draindown",null,null,null,null,{"$f":"IF(O14,O13-O14,\"\")","v":""},null,{"$f":"IF(Q14,Q13-Q14,\"\")","v":""}]
[null,null,null,null,null,null,null,null,null,"% Draindown",null,null,null,null,{"$f":"(O15/O13)*100","v":{"$error":"#VALUE!"}},null,{"$f":"(Q15/Q13)*100","v":{"$error":"#VALUE!"}}]
[null,null,null,null,null,null,null,null,null,"Average draindown",null,null,null,null,{"$f":"AVERAGE(O16:R16)","v":{"$error":"#VALUE!"}}]
[]
[]
[null,null,null,null,null,null,null,null,null,"Elevated Temperature (+27 F)"]
[null,null,null,null,null,null,null,null,null,"Sample No.",null,null,null,null,1,null,2]
[null,null,null,null,null,null,null,null,null,"Temperature of Sample"]
[null,null,null,null,null,null,null,null,null,"Initial Wt of Sample"]
[null,null,null,null,null,null,null,null,null,"Wt. of sample after 1 hour"]
[null,null,null,null,null,null,null,null,null,"Wt. of draindown",null,null,null,null,{"$f":"IF(O24,O23-O24,\"\")","v":""},null,{"$f":"IF(Q24,Q23-Q24,\"\")","v":""}]
[null,null,null,null,null,null,null,null,null,"% Draindown",null,null,null,null,{"$f":"(O25/O23)*100","v":{"$error":"#VALUE!"}},null,{"$f":"(Q25/Q23)*100","v":{"$error":"#VALUE!"}}]
[null,null,null,null,null,null,null,null,null,"Average draindown",null,null,null,null,{"$f":"AVERAGE(O26:R26)","v":{"$error":"#VALUE!"}}]

{"sheet":"T-283","index":13,"n_rows":53,"n_cols":39,"rows_kept":53,"cut":false,"hidden":false,"merged":[[17,2,18,23],[32,6,32,23],[39,15,39,23],[39,6,39,14],[39,1,39,5],[41,14,41,15],[41,8,41,13],[35,1,35,5],[38,1,38,5],[37,1,37,5],[36,1,36,5],[38,6,38,14],[38,15,38,23],[36,18,36,20],[36,21,36,23],[37,6,37,8],[37,15,37,17],[37,9,37,11],[37,12,37,14],[37,18,37,20],[37,21,37,23],[36,6,36,8],[36,9,36,11],[36,12,36,14],[36,15,36,17],[34,6,34,14],[34,15,34,23],[35,6,35,8],[35,9,35,11],[35,12,35,14],[35,15,35,17],[35,18,35,20],[35,21,35,23],[27,3,27,14],[28,3,28,14],[29,3,29,14],[30,4,30,14],[24,15,24,23],[26,15,26,23],[27,21,27,23],[27,18,27,20],[27,15,27,17],[30,21,30,23],[30,18,30,20],[30,15,30,17],[29,21,29,23],[29,18,29,20],[29,15,29,17],[28,21,28,23],[28,18,28,20],[28,15,28,17],[19,15,19,23],[22,6,22,8],[22,15,22,17],[22,3,22,5],[21,12,21,14],[21,15,21,17],[21,18,21,20],[21,21,21,23],[20,3,20,5],[21,3,21,5],[20,21,20,23],[20,18,20,20],[20,15,20,17],[20,12,20,14],[20,9,20,11],[20,6,20,8],[21,6,21,8],[21,9,21,11],[19,6,19,14],[5,2,5,4],[5,5,5,7],[5,9,5,14],[8,2,8,5],[9,2,9,5],[10,2,10,5],[7,13,7,20],[0,1,0,2],[2,1,2,24],[3,2,3,4],[3,5,3,8],[3,9,3,14],[3,19,3,21],[3,22,3,23],[5,15,5,17],[5,19,5,21],[5,22,5,23],[4,2,4,4],[4,5,4,8],[4,9,4,14],[4,15,4,17],[4,20,4,21],[4,22,4,23],[8,6,8,8],[8,9,8,11],[9,9,9,11],[9,6,9,8],[8,15,8,17],[8,18,8,20],[8,21,8,23],[10,6,10,8],[10,9,10,11],[12,6,12,8],[12,9,12,11],[12,12,12,14],[12,15,12,17],[12,18,12,20],[9,21,9,23],[9,18,9,20],[9,15,9,17],[9,12,9,14],[11,2,11,5],[12,2,12,5],[15,21,15,23],[14,2,14,5],[15,2,15,5],[13,21,13,23],[13,18,13,20],[13,15,13,17],[13,12,13,14],[13,9,13,11],[13,6,13,8],[14,6,14,8],[14,9,14,11],[13,2,13,5],[15,6,15,8],[15,9,15,11],[15,12,15,14],[15,15,15,17],[15,18,15,20],[11,6,11,8],[11,9,11,11],[11,12,11,14],[11,15,11,17],[11,18,11,20],[7,21,7,23],[14,12,14,14],[14,15,14,17],[14,18,14,20],[14,21,14,23],[12,21,12,23],[10,12,10,14],[10,15,10,17],[10,18,10,20],[10,21,10,23],[11,21,11,23],[8,12,8,14],[3,15,3,18],[47,21,47,23],[47,18,47,20],[47,15,47,17],[47,12,47,14],[47,9,47,11],[47,6,47,8],[47,0,47,5],[48,6,48,8],[48,9,48,11],[48,12,48,14],[48,15,48,17],[48,18,48,20],[48,21,48,23],[48,0,48,5],[45,6,45,14],[45,15,45,23],[43,11,43,17],[46,6,46,8],[46,9,46,11],[46,12,46,14],[46,15,46,17],[46,18,46,20],[46,21,46,23]]}
[null,{"$f":"Setup!A2","v":"ESB-19"}]
[]
[null,"AASHTO T 283"]
[null,null,"Producer;",null,null,{"$f":"Setup!E7","v":0},null,null,null,"Material Class:",null,null,null,null,null,{"$f":"Setup!E10","v":0},null,null,null,"Nominal Size:",null,null,{"$f":"Setup!E9","v":0}]
[null,null,"Designed By:",null,null,{"$f":"Setup!E8","v":0},null,null,null,"Esals:",null,null,null,null,null,{"$f":"Setup!E12","v":0},null,null,null,null,"SRL:",null,{"$f":"Setup!E11","v":0}]
[null,null,"Date:",null,null,{"$f":"Setup!E6","v":"00:00:00"},null,null,null,"Rap:",null,null,null,null,null,{"$f":"Setup!E17","v":0},null,null,null,"PG Grade:",null,null,{"$f":"Setup!E14","v":0}]
[]
[null,null,null,null,null,null,null,null,null,null,null,null,null,"Maximum Theoretical Gravity (Gmm) ="]
[null,null,"Specimen No.",null,null,null,1,null,null,2,null,null,3,null,null,4,null,null,5,null,null,6]
[null,null,"Height of Specimen"]
[null,null,"Mass in Air"]
[null,null,"Mass in H2O"]
[null,null,"Mass at SSD"]
[null,null,"Bulk Sp. Gr.",null,null,null,{"$f":"IF(G13,ROUND(G11/(G13-G12),3),\" \")","v":" "},null,null,{"$f":"IF(J13,ROUND(J11/(J13-J12),3),\" \")","v":" "},null,null,{"$f":"IF(M13,ROUND(M11/(M13-M12),3),\" \")","v":" "},null,null,{"$f":"IF(P13,ROUND(P11/(P13-P12),3),\" \")","v":" "},null,null,{"$f":"IF(S13,ROUND(S11/(S13-S12),3),\" \")","v":" "},null,null,{"$f":"IF(V13,ROUND(V11/(V13-V12),3),\" \")","v":" "}]
[null,null,"Voids ",null,null,null,{"$f":"IF(G13,ROUND(100-(G14/$V$8*100),1),\" \")","v":" "},null,null,{"$f":"IF(J13,ROUND(100-(J14/$V$8*100),1),\" \")","v":" "},null,null,{"$f":"IF(M13,ROUND(100-(M14/$V$8*100),1),\" \")","v":" "},null,null,{"$f":"IF(P13,ROUND(100-(P14/$V$8*100),1),\" \")","v":" "},null,null,{"$f":"IF(S13,ROUND(100-(S14/$V$8*100),1),\" \")","v":" "},null,null,{"$f":"IF(V13,ROUND(100-(V14/$V$8*100),1),\" \")","v":" "}]
[null,null,"Volume of Air Voids",null,null,null,{"$f":"IF(G13,(G13-G12)-(G11/$V$8),\"\")","v":""},null,null,{"$f":"IF(J13,(J13-J12)-(J11/$V$8),\"\")","v":""},null,null,{"$f":"IF(M13,(M13-M12)-(M11/$V$8),\"\")","v":""},null,null,{"$f":"IF(P13,(P13-P12)-(P11/$V$8),\"\")","v":""},null,null,{"$f":"IF(S13,(S13-S12)-(S11/$V$8),\"\")","v":""},null,null,{"$f":"IF(V13,(V13-V12)-(V11/$V$8),\"\")","v":""}]
[]
[null,null,"Group specimens into 2 subsets of 3 specimens each, so the average voids of the 2 subset are approx. equal"]
[]
[null,null,null,null,null,null,"Unconditioned Set",null,null,null,null,null,null,null,null,"Conditioned Set"]
[null,null,null,"Specimen No."]
[null,null,null,"Voids",null,null,{"$f":"IF(G21,CHOOSE(G21,$G$15,$J$15,$M$15,$P$15,$S$15,$V$15),\" \")","v":" "},null,null,{"$f":"IF(J21,CHOOSE(J21,$G$15,$J$15,$M$15,$P$15,$S$15,$V$15),\" \")","v":" "},null,null,{"$f":"IF(M21,CHOOSE(M21,$G$15,$J$15,$M15,$P$15,$S$15,$V$15),\" \")","v":" "},null,null,{"$f":"IF(P21,CHOOSE(P21,$G$15,$J$15,$M15,$P$15,$S$15,$V$15),\" \")","v":" "},null,null,{"$f":"IF(S21,CHOOSE(S21,$G$15,$J$15,$M15,$P$15,$S$15,$V$15),\" \")","v":" "},null,null,{"$f":"IF(V21,CHOOSE(V21,$G$15,$J$15,$M15,$P$15,$S$15,$V$15),\" \")","v":" "}]
[null,null,null,"Average voids",null,null,{"$f":"IF(ISTEXT(G22),\"\",AVERAGE(G22:O22))","v":""},null,null,null,null,null,null,null,null,{"$f":"IF(ISTEXT(P22),\"\",AVERAGE(P22:X22))","v":""}]
[]
[null,null,null,null,null,null,null,null,null,null,null,null,null,null,null,"Saturation of Conditioned Set"]
[]
[null,null,null,null,null,null,null,null,null,null,null,null,null,null,null,"Conditioned Set"]
[null,null,null,"Specimen number",null,null,null,null,null,null,null,null,null,null,null,{"$f":"IF(P21,P21,\"\")","v":""},null,null,{"$f":"IF(S21,S21,\"\")","v":""},null,null,{"$f":"IF(V21,V21,\"\")","v":""}]
[null,null,null,"SSD Mass After Partial Vacuum"]
[null,null,null,"Volume of Water Absorbed (cc)",null,null,null,null,null,null,null,null,null,null,null,{"$f":"IF(P29,P29-CHOOSE(P21,$G$11,$J$11,$M$11,$P$11,$S$11,$V$11,),\" \")","v":" "},null,null,{"$f":"IF(S29,S29-CHOOSE(S21,$G$11,$J$11,$M$11,$P$11,$S$11,$V$11,),\" \")","v":" "},null,null,{"$f":"IF(V29,V29-CHOOSE(V21,$G$11,$J$11,$M$11,$P$11,$S$11,$V$11,),\" \")","v":" "}]
[null,null,null,null,"% Saturation",null,null,null,null,null,null,null,null,null,null,{"$f":"IF(P29,100*P30/CHOOSE(P21,$G$16,$J$16,$M$16,$P$16,$S$16,$V$16,),\" \")","v":" "},null,null,{"$f":"IF(S29,100*S30/CHOOSE(S21,$G$16,$J$16,$M$16,$P$16,$S$16,$V$16,),\" \")","v":" "},null,null,{"$f":"IF(V29,100*V30/CHOOSE(V21,$G$16,$J$16,$M$16,$P$16,$S$16,$V$16,),\" \")","v":" "}]
[]
[null,null,null,null,null,null,"Tensile Strength Ratio"]
[]
[null,null,null,null,null,null,"Unconditioned Set",null,null,null,null,null,null,null,null,"Conditioned Set"]
[null,"Specimen No.",null,null,null,null,{"$f":"IF(G21,G21,\"\")","v":""},null,null,{"$f":"IF(J21,J21,\"\")","v":""},null,null,{"$f":"IF(M21,M21,\"\")","v":""},null,null,{"$f":"IF(P21,P21,\"\")","v":""},null,null,{"$f":"IF(S21,S21,\"\")","v":""},null,null,{"$f":"IF(V21,V21,\"\")","v":""}]
[null,"Load (lbs)"]
[null,"Tensile Strength (psi)",null,null,null,null,{"$f":"IF(G37,2*G37/(CHOOSE(G36,$G$10,$J$10,$M$10,$P$10,$S$10,$V$10,)*3.141592654/25.4*6),\" \")","v":" "},null,null,{"$f":"IF(J37,2*J37/(CHOOSE(J36,$G$10,$J$10,$M$10,$P$10,$S$10,$V$10,)*3.141592654/25.4*6),\" \")","v":" "},null,null,{"$f":"IF(M37,2*M37/(CHOOSE(M36,$G$10,$J$10,$M$10,$P$10,$S$10,$V$10,)*3.141592654/25.4*6),\" \")","v":" "},null,null,{"$f":"IF(P37,2*P37/(CHOOSE(P36,$G$10,$J$10,$M$10,$P$10,$S$10,$V$10,)*3.141592654/25.4*6),\" \")","v":" "},null,null,{"$f":"IF(S37,2*S37/(CHOOSE(S36,$G$10,$J$10,$M$10,$P$10,$S$10,$V$10,)*3.141592654/25.4*6),\" \")","v":" "},null,null,{"$f":"IF(V37,2*V37/(CHOOSE(V36,$G$10,$J$10,$M$10,$P$10,$S$10,$V$10,)*3.141592654/25.4*6),\" \")","v":" "}]
[null,"Average psi",null,null,null,null,{"$f":"IF(G37,AVERAGE(G38:O38),\"\")","v":""},null,null,null,null,null,null,null,null,{"$f":"IF(P37,AVERAGE(P38:X38),\"\")","v":""}]
[null,"Coefficient of Variation",null,null,null,null,{"$f":"IF(G37,STDEV(G38:O38)/G39,\" \")","v":" "},null,null,null,null,null,null,null,null,{"$f":"IF(P37,STDEV(P38:X38)/P39,\" \")","v":" "}]
[]
[null,null,null,null,null,null,null,null,"Tensile Strength Ratio=",null,null,null,null,null,{"$f":"IF(G37,100*(P39/G39),\" \")","v":" "}]
[]
[null,null,null,null,null,null,null,null,null,null,null,"Visual Observations"]
[]
[null,null,null,null,null,null,"Unconditioned Set",null,null,null,null,null,null,null,null,"Conditioned Set"]
[null,null,null,null,null,null,{"$f":"IF(G21,G21,\"\")","v":""},null,null,{"$f":"IF(J21,J21,\"\")","v":""},null,null,{"$f":"IF(M21,M21,\"\")","v":""},null,null,{"$f":"IF(P21,P21,\"\")","v":""},null,null,{"$f":"IF(S21,S21,\"\")","v":""},null,null,{"$f":"IF(V21,V21,\"\")","v":""}]
["Visual Damage (0 to 5 rating)",null,null,null,null,null,0,null,null,0,null,null,0,null,null,0,null,null,0,null,null,0,null,null,null,null,null,null,null,null,null,null,null,null,null,null,0]
["Cracked / Broken Agg.",null,null,null,null,null,"No",null,null,"No",null,null,"No",null,null,"No",null,null,"No",null,null,"No",null,null,null,null,null,null,null,null,null,null,null,null,null,null,1,null,"Yes "]
[null,null,null,null,null,null,null,null,null,null,null,null,null,null,null,null,null,null,null,null,null,null,null,null,null,null,null,null,null,null,null,null,null,null,null,null,2,null,"No"]
[null,null,null,null,null,null,null,null,null,null,null,null,null,null,null,null,null,null,null,null,null,null,null,null,null,null,null,null,null,null,null,null,null,null,null,null,3]
[null,null,null,null,null,null,null,null,null,null,null,null,null,null,null,null,null,null,null,null,null,null,null,null,null,null,null,null,null,null,null,null,null,null,null,null,4]
[null,null,null,null,null,null,null,null,null,null,null,null,null,null,null,null,null,null,"`",null,null,null,null,null,null,null,null,null,null,null,null,null,null,null,null,null,5]

{"sheet":"Height Data","index":14,"n_rows":18,"n_cols":33,"rows_kept":18,"cut":false,"hidden":false,"merged":[[5,9,5,11],[5,13,5,18],[5,19,5,21],[5,23,5,25],[5,26,5,27],[4,6,4,8],[4,9,4,12],[4,13,4,18],[4,19,4,21],[4,24,4,25],[4,26,4,27],[0,5,0,6],[2,5,2,28],[3,6,3,8],[3,9,3,12],[3,13,3,18],[3,23,3,25],[3,26,3,27],[17,26,17,27],[17,28,17,29],[16,20,16,21],[16,22,16,23],[16,24,16,25],[15,26,15,27],[15,28,15,29],[14,26,14,27],[14,28,14,29],[13,26,13,27],[13,28,13,29],[12,26,12,27],[12,28,12,29],[11,26,11,27],[11,28,11,29],[10,12,10,13],[5,6,5,8],[17,30,17,31],[17,32,17,33],[7,2,7,13],[7,14,7,29],[7,30,7,33],[17,14,17,15],[17,16,17,17],[17,18,17,19],[17,20,17,21],[17,22,17,23],[17,24,17,25],[16,26,16,27],[16,28,16,29],[16,30,16,31],[16,32,16,33],[17,2,17,3],[17,4,17,5],[17,6,17,7],[17,8,17,9],[17,10,17,11],[17,12,17,13],[16,14,16,15],[16,16,16,17],[16,18,16,19],[15,30,15,31],[15,32,15,33],[16,2,16,3],[16,4,16,5],[16,6,16,7],[16,8,16,9],[16,10,16,11],[16,12,16,13],[15,14,15,15],[15,16,15,17],[15,18,15,19],[15,20,15,21],[15,22,15,23],[15,24,15,25],[15,2,15,3],[15,4,15,5],[15,6,15,7],[15,8,15,9],[15,10,15,11],[15,12,15,13],[14,14,14,15],[14,16,14,17],[14,18,14,19],[13,32,13,33],[14,2,14,3],[14,4,14,5],[14,6,14,7],[14,8,14,9],[14,10,14,11],[14,12,14,13],[13,14,13,15],[13,16,13,17],[13,18,13,19],[13,20,13,21],[13,22,13,23],[13,24,13,25],[14,30,14,31],[14,32,14,33],[14,20,14,21],[14,22,14,23],[14,24,14,25],[13,10,13,11],[13,12,13,13],[11,18,11,19],[11,20,11,21],[11,22,11,23],[11,24,11,25],[11,2,11,3],[11,4,11,5],[11,6,11,7],[11,8,11,9],[11,10,11,11],[11,12,11,13],[12,30,12,31],[12,32,12,33],[12,0,12,1],[13,0,13,1],[14,0,14,1],[15,0,15,1],[16,0,16,1],[11,30,11,31],[12,14,12,15],[12,16,12,17],[12,18,12,19],[12,20,12,21],[12,22,12,23],[12,24,12,25],[13,30,13,31],[11,32,11,33],[12,2,12,3],[12,4,12,5],[12,6,12,7],[12,8,12,9],[12,10,12,11],[12,12,12,13],[11,14,11,15],[11,16,11,17],[17,0,17,1],[8,24,8,25],[8,26,8,27],[8,28,8,29],[10,10,10,11],[10,8,10,9],[10,6,10,7],[10,4,10,5],[10,2,10,3],[10,24,10,25],[10,22,10,23],[10,20,10,21],[10,18,10,19],[10,16,10,17],[10,14,10,15],[13,2,13,3],[13,4,13,5],[13,6,13,7],[13,8,13,9],[10,0,10,1],[11,0,11,1],[9,0,9,1],[9,4,9,5],[9,6,9,7],[8,2,8,5],[8,6,8,9],[8,10,8,13],[8,14,8,15],[8,16,8,17],[8,18,8,19],[8,20,8,21],[8,22,8,23],[9,12,9,13],[9,14,9,15],[9,16,9,17],[9,18,9,19],[9,20,9,21],[9,22,9,23],[9,2,9,3],[9,8,9,9],[9,10,9,11],[3,19,3,22],[8,31,8,33],[10,32,10,33],[10,30,10,31],[10,28,10,29],[10,26,10,27],[9,24,9,25],[9,26,9,27],[9,32,9,33],[9,30,9,31],[9,28,9,29]]}
[null,{"$f":"Setup!A2","v":"ESB-19"},null,null,null,{"$f":"Setup!E2","v":"00:00:00"}]
[]
[null,null,null,null,null,"AASHTO T 283"]
[null,null,null,null,null,null,"Producer;",null,null,{"$f":"Setup!E7","v":0},null,null,null,"Material Class:",null,null,null,null,null,{"$f":"Setup!E10","v":0},null,null,null,"Nominal Size:",null,null,{"$f":"Setup!E9","v":0}]
[null,null,null,null,null,null,"Designed By:",null,null,{"$f":"Setup!E8","v":0},null,null,null,"Esals:",null,null,null,null,null,{"$f":"Setup!E12","v":0},null,null,null,null,"SRL:",null,{"$f":"Setup!E11","v":0}]
[null,null,null,null,null,null,"Date:",null,null,{"$f":"Setup!E6","v":"00:00:00"},null,null,null,"Rap:",null,null,null,null,null,{"$f":"Setup!E17","v":0},null,null,null,"PG Grade:",null,null,{"$f":"Setup!E14","v":0}]
[]
[null,null,"Trial Blends",null,null,null,null,null,null,null,null,null,null,null,"AC Trials",null,null,null,null,null,null,null,null,null,null,null,null,null,null,null,"Nmax"]
[null,null,"Blend 1",null,null,null,"Blend 2",null,null,null,"Blend 3",null,null,null,{"$f":"'Gmm2'!K16","v":-0.5},null,"AC",null,{"$f":"'Gmm2'!K17","v":0},null,"AC",null,{"$f":"'Gmm2'!K18","v":0.5},null,"AC",null,{"$f":"'Gmm2'!K19","v":1},null,"AC",null,{"$f":"Nmax!B12","v":0},"AC @Nmax"]
["Gyration",null,1,null,2,null,1,null,2,null,1,null,2,null,1,null,2,null,1,null,2,null,1,null,2,null,1,null,2,null,1,null,2]
[6]
[7]
[8]
[50]
[75]
[100]
[115]
[160]

{"sheet":"TR 448A","index":15,"n_rows":71,"n_cols":27,"rows_kept":71,"cut":false,"hidden":false,"merged":[[68,0,68,2],[68,3,68,11],[68,12,68,14],[68,15,68,16],[68,18,68,20],[70,0,70,2],[70,3,70,11],[70,12,70,14],[70,15,70,16],[70,18,70,20],[62,17,62,19],[64,0,64,20],[66,0,66,2],[66,3,66,11],[66,12,66,14],[66,15,66,16],[66,18,66,20],[62,1,62,2],[62,3,62,6],[62,7,62,9],[62,10,62,12],[62,13,62,14],[62,15,62,16],[57,0,57,20],[58,1,61,2],[58,3,61,6],[58,7,60,12],[58,13,60,16],[58,17,61,19],[61,7,61,9],[61,10,61,12],[61,13,61,14],[61,15,61,16],[55,1,55,3],[55,4,55,6],[55,7,55,9],[55,10,55,11],[55,12,55,15],[55,16,55,19],[54,1,54,3],[54,4,54,6],[54,7,54,9],[54,10,54,11],[54,12,54,15],[54,16,54,19],[53,1,53,3],[53,4,53,6],[53,7,53,9],[53,10,53,11],[53,12,53,15],[53,16,53,19],[52,1,52,3],[52,4,52,6],[52,7,52,9],[52,10,52,11],[52,12,52,15],[52,16,52,19],[51,1,51,3],[51,4,51,6],[51,7,51,9],[51,10,51,11],[51,12,51,15],[51,16,51,19],[49,0,49,20],[50,1,50,3],[50,4,50,6],[50,7,50,9],[50,12,50,15],[50,16,50,19],[47,1,47,3],[47,4,47,9],[47,10,47,11],[47,12,47,14],[47,15,47,17],[47,18,47,19],[45,0,45,20],[46,1,46,3],[46,4,46,9],[46,10,46,11],[46,12,46,14],[46,15,46,17],[46,18,46,19],[43,0,43,2],[43,3,43,5],[43,6,43,7],[43,8,43,9],[43,10,43,11],[43,12,43,13],[43,14,43,16],[43,17,43,20],[41,0,42,2],[41,3,42,5],[41,6,42,7],[41,8,42,9],[41,10,42,11],[41,12,42,13],[40,0,40,2],[40,3,40,5],[40,6,40,7],[40,8,40,9],[40,10,40,11],[40,12,40,13],[40,14,40,16],[40,17,40,20],[41,14,42,16],[41,17,42,20],[35,0,35,4],[37,0,37,20],[38,0,39,2],[38,3,39,5],[38,6,39,7],[38,8,39,9],[38,10,39,11],[38,12,39,13],[38,14,39,16],[38,17,39,20],[35,6,35,13],[35,14,35,15],[28,0,28,20],[29,2,31,2],[32,0,32,1],[33,0,33,4],[33,6,33,10],[33,11,33,13],[33,14,34,16],[33,17,34,17],[34,0,34,4],[34,6,34,10],[34,11,34,13],[26,0,26,4],[26,5,26,7],[26,8,26,10],[26,11,26,13],[26,14,26,16],[26,17,26,20],[25,0,25,4],[25,5,25,7],[25,8,25,10],[25,11,25,13],[25,14,25,16],[25,17,25,20],[24,0,24,4],[24,5,24,7],[24,8,24,10],[24,11,24,13],[24,14,24,16],[24,17,24,20],[23,0,23,4],[23,5,23,7],[23,8,23,10],[23,11,23,13],[23,14,23,16],[23,17,23,20],[22,0,22,4],[22,5,22,7],[22,8,22,10],[22,11,22,13],[22,14,22,16],[22,17,22,20],[21,0,21,4],[21,5,21,7],[21,8,21,10],[21,11,21,13],[21,14,21,16],[21,17,21,20],[20,0,20,4],[20,5,20,7],[20,8,20,10],[20,11,20,13],[20,14,20,16],[20,17,20,20],[19,0,19,4],[19,5,19,7],[19,8,19,10],[19,11,19,13],[19,14,19,16],[19,17,19,20],[18,0,18,4],[18,5,18,7],[18,8,18,10],[18,11,18,13],[18,14,18,16],[18,17,18,20],[17,0,17,4],[17,5,17,7],[17,8,17,10],[17,11,17,13],[17,14,17,16],[17,17,17,20],[16,0,16,4],[16,5,16,7],[16,8,16,10],[16,11,16,13],[16,14,16,16],[16,17,16,20],[12,19,12,20],[14,0,14,1],[14,2,14,3],[14,4,14,6],[14,7,14,11],[14,12,14,13],[14,14,14,17],[10,0,10,3],[10,4,10,11],[10,12,10,14],[10,15,10,20],[12,0,12,4],[12,5,12,6],[12,7,12,10],[12,11,12,12],[12,13,12,15],[12,16,12,17],[8,0,8,1],[8,2,8,4],[8,5,8,6],[8,7,8,12],[8,14,8,20],[4,6,4,9],[4,13,4,18],[4,19,4,20],[5,7,5,8],[5,13,5,18],[5,19,5,20],[2,13,2,16],[2,17,2,20],[3,6,3,7],[3,8,3,9],[3,15,3,18],[3,19,3,20],[0,0,0,3],[0,4,0,12],[0,13,0,16],[0,17,0,20],[1,0,6,3],[1,6,1,9],[1,13,1,16],[1,17,1,20],[2,6,2,7],[2,8,2,9],[6,7,6,8],[6,13,6,18],[6,19,6,20]]}
["TR-448A   (1-15)",null,null,null,"JOB MIX FORMULA REPORT",null,null,null,null,null,null,null,null,"SUPPLIER CODE",null,null,null,"MATERIAL CLASS",null,null,null,null,null,null,"PG 46-40",null,100]
[null,null,null,null,null,null,"PennDOT JMF No.",null,null,null,null,null,null,null,null,null,null,null,null,null,null,null,"SP4.75","L","PG 52-28",null,150]
[null,null,null,null,null,null,null,null,null,null,null,null,null,"Design ESAL'S",null,null,null,null,null,null,null,null,"SR4.75","M","PG 58-28"]
[null,null,null,null,null,null,"Year",null,"No.",null,null,null,null,null,null,"Aggregate SRL",null,null,null,null,null,null,"SP6.33","G","PG 64-22",null,"PTM 702"]
[null,null,null,null,null,null,"Supplier JMF No.",null,null,null,null,null,null,"Mixture Final PG Binder Grade",null,null,null,null,null,null,null,null,"SP9.5","H","PG 64-28",null,"PTM 757"]
[null,null,null,null,null,null,null,null,null,null,null,null,null,"Asphalt Mix Type",null,null,null,null,null,null,null,null,"SR9.5","E","PG 76-22"]
[null,null,null,null,null,null,null,"No.",null,null,null,null,null,"Original Approval Date",null,null,null,null,null,null,null,null,"SP12.5",null,"PG 58S-28"]
[null,null,null,null,null,null,null,null,null,null,null,null,null,null,null,null,null,null,null,null,null,null,"SR12.5",null,"PG 64S-22"]
["DATE",null,null,null,null,"SPEC",null,null,null,null,null,null,null,"PO",null,null,null,null,null,null,null,null,"SP19W",null,"PG 64E-22"]
[null,null,null,null,null,null,null,null,null,null,null,null,null,null,null,null,null,null,null,null,null,null,"SP19B"]
["SUPPLIER NAME",null,null,null,null,null,null,null,null,null,null,null,"LOCATION",null,null,null,null,null,null,null,null,null,"SP19W / SP19B"]
[null,null,null,null,null,null,null,null,null,null,null,null,null,null,null,null,null,null,null,null,null,null,"SR19W",null,"HMA"]
["BITUMINOUS PLANT TYPE",null,null,null,null,null,null,"TONS PER HOUR",null,null,null,null,null,"ECMS NO.",null,null,null,null,null,"Mix Time",null,null,"SR19B",null,"WMA"]
[null,null,null,null,null,null,null,null,null,null,null,null,null,null,null,null,null,null,null,"Dry","Wet",null,"SR19W / SR19B",null,"COLD"]
["SR & SEC",null,null,null,"CONTRACTOR",null,null,null,null,null,null,null,"LOCATION",null,null,null,null,null,null,null,null,null,"SP25B"]
[null,null,null,null,null,null,null,null,null,null,null,null,null,null,null,null,null,null,null,null,null,null,"SP25BC"]
["Material Supplier Code",null,null,null,null,"Material Code",null,null,"Material Class",null,null,"% In Mix",null,null,"Bulk Sp. Gr.",null,null,"% Absorption",null,null,null,null,"SP25B / SP25BC"]
[null,null,null,null,null,null,null,null,null,null,null,null,null,null,null,null,null,null,null,null,null,null,"SR25B"]
[null,null,null,null,null,null,null,null,null,null,null,null,null,null,null,null,null,null,null,null,null,null,"SR25BC"]
[null,null,null,null,null,null,null,null,null,null,null,null,null,null,null,null,null,null,null,null,null,null,"SR25B / SR25BC"]
[null,null,null,null,null,null,null,null,null,null,null,null,null,null,null,null,null,null,null,null,null,null,"SP37.5"]
[null,null,null,null,null,null,null,null,null,null,null,null,null,null,null,null,null,null,null,null,null,null,"SR37.5"]
[null,null,null,null,null,null,null,null,null,null,null,null,null,null,null,null,null,null,null,null,null,null,"SMA95"]
[null,null,null,null,null,null,null,null,null,null,null,null,null,null,null,null,null,null,null,null,null,null,"SMA125"]
[null,null,null,null,null,null,null,null,null,null,null,null,null,null,null,null,null,null,null,null,null,null,"ATPBC"]
[null,null,null,null,null,null,null,null,null,null,null,null,null,null,null,null,null,null,null,null,null,null,"WM6.33"]
[null,null,null,null,null,null,null,null,null,null,null,null,null,null,null,null,null,null,null,null,null,null,"WM9.5"]
[null,null,null,null,null,null,null,null,null,null,null,null,null,null,null,null,null,null,null,null,null,null,"WR9.5"]
["JOB MIX FORMULA AND DESIGN",null,null,null,null,null,null,null,null,null,null,null,null,null,null,null,null,null,null,null,null,null,"WM12.5"]
[null,null,"AC %",7.4999999999999997E-2,0.15,0.3,0.6,1.18,2.36,4.75,6.33,9.5,12.5,19,25,37.5,50,"F/A","Pbe",null,null,null,"WR12.5"]
[null,null,null,"mm","mm","mm","mm","mm","mm","mm","mm","mm","mm","mm","mm","mm","mm",null,null,null,null,null,"WM19W"]
[null,null,null,"#200","#100","#50","#30","#16","#8","#4",0.25,0.375,0.5,0.75,1,1.5,2,null,null,null,null,null,"WM19B"]
["Design",null,null,null,null,null,null,null,null,null,null,null,null,null,null,null,null,null,null,null,null,null,"WM19W / WM19B"]
["% Virgin AC",null,null,null,null,null,"Virgin AC PG Binder Grade",null,null,null,null,null,null,null,"Asphalt Film Thickness (micron)",null,null,{"$f":"Sheet1!F12","v":{"$error":"#DIV/0!"}},null,null,null,null,"WR19W"]
["% Reclaimed AC from RAP",null,null,null,null,null,"Reclaimed Binder Ratio",null,null,null,null,{"$f":"ROUND((F35+F36)/C33,2)","v":{"$error":"#DIV/0!"}},null,null,null,null,null,null,null,null,null,null,"WR19B"]
["% Reclaimed AC from RAS",null,null,null,null,null,"% Draindown at anticipated temperature",null,null,null,null,null,null,null,null,null,null,null,null,null,null,null,"WR19W / WR19B"]
[null,null,null,null,null,null,null,null,null,null,null,null,null,null,null,null,null,null,null,null,null,null,"WM25B"]
["MIX CHARACTERISTICS (Gyratory)",null,null,null,null,null,null,null,null,null,null,null,null,null,null,null,null,null,null,null,null,null,"WM25BC"]
["Design       ESALS",null,null,"Mold Diameter (mm)",null,null,"Gyrations @ Nini",null,"Gyrations @ Ndes",null,"Gyrations @ Nmax",null,"%VMA   @ Ndes",null,"Max. Sp. Gr. (Gmm)",null,null,"Ndes Bulk Sp. Gr. (Gmb)",null,null,null,null,"WM25B / WM25BC"]
[null,null,null,null,null,null,null,null,null,null,null,null,null,null,null,null,null,null,null,null,null,null,"WR25B"]
[{"$f":"IF(ISBLANK(R3),\"\",R3)","v":""},null,null,null,null,null,null,null,null,null,null,null,null,null,null,null,null,null,null,null,null,null,"WR25BC"]
["Combine Agg. Gsb",null,null,"Mass of Specimen",null,null,"% Voids                @ Nini",null,"%Voids                 @ Ndes",null,"%Voids   @ Nmax",null,"%VFA   @ Ndes",null,"Max. Density (Lbs./Cu. Ft.)",null,null,"Ndes Bulk Density (Lbs./Cu. Ft.)",null,null,null,null,"WR25B / WR25BC"]
[null,null,null,null,null,null,null,null,null,null,null,null,null,null,null,null,null,null,null,null,null,null,"WM37.5"]
[null,null,null,null,null,null,null,null,null,null,null,null,null,null,{"$f":"IF(ISBLANK(O41),\"\",O41*62.245)","v":""},null,null,{"$f":"IF(ISBLANK(R41),\" \",R41*62.245)","v":" "},null,null,null,null,"WR37.5"]
[]
["ASPHALT CONTENT TEST METHOD"]
[null,"AC Test Method",null,null,"Oven Model / Series",null,null,null,null,null,"Set Temp.",null,"Sample Size",null,null,"Asphalt C/F",null,null,"200 C/F",null,null,null,null,null,"<0.3"]
[null,null,null,null,null,null,null,null,null,null,null,null,null,null,null,null,null,null,null,null,null,null,null,null,".3 to <3"]
[null,null,null,null,null,null,null,null,null,null,null,null,null,null,null,null,null,null,null,null,null,null,null,null,"3 to <10"]
["TSR DATA",null,null,null,null,null,null,null,null,null,null,null,null,null,null,null,null,null,null,null,null,null,null,null,"10 to <30"]
[null,"AC Supplier",null,null,"Dry PSI Strength",null,null,"Wet PSI Strength",null,null,"TSR Value",null,"Date TSR's were done",null,null,null,"Date of Boil Test",null,null,null,null,null,null,null,"3 to <30"]
[null,null,null,null,null,null,null,null,null,null,{"$f":"IF(ISBLANK(H52),\" \",(H52/E52)*100)","v":" "},null,null,null,null,null,null,null,null,null,null,null,null,null,"> 30"]
[null,null,null,null,null,null,null,null,null,null,{"$f":"IF(ISBLANK(H53),\" \",(H53/E53)*100)","v":" "}]
[null,null,null,null,null,null,null,null,null,null,{"$f":"IF(ISBLANK(H54),\" \",(H54/E54)*100)","v":" "}]
[null,null,null,null,null,null,null,null,null,null,{"$f":"IF(ISBLANK(H55),\" \",(H55/E55)*100)","v":" "}]
[null,null,null,null,null,null,null,null,null,null,{"$f":"IF(ISBLANK(H56),\" \",(H56/E56)*100)","v":" "}]
[]
["Combined Aggregate Consensus Properties"]
[null,"AASHTO T176 Sand Equivalent",null,"AASHTO T304 Uncompacted Void Content (Fine Aggregate Angularity)",null,null,null,"ASTM D5821 Coarse Aggregate Angularity",null,null,null,null,null,"ASTM D4791 Flat & Elongated",null,null,null,"Total % Reclaimed Agg. From RAP and / or RAS"]
[]
[]
[null,null,null,null,null,null,null,"1-Face Crush",null,null,"2-Face Crush",null,null,"5:1",null,"3:1 SMA only"]
[]
[]
["GRADATION CHART IS PART OF THIS JOB MIX FORMULA"]
[]
["Designed by:",null,null,null,null,null,null,null,null,null,null,null,"Cert. ID. No.",null,null,null,null,"Date"]
[]
["Submitted by:",null,null,null,null,null,null,null,null,null,null,null,"Cert. ID. No.",null,null,null,null,"Date"]
[]
["Reviewed by:",null,null,null,null,null,null,null,null,null,null,null,"Cert. ID. No.",null,null,null,null,"Date"]

{"sheet":"Sheet1","index":16,"n_rows":25,"n_cols":7,"rows_kept":25,"cut":false,"hidden":true,"merged":[[5,3,5,4],[7,3,7,4],[9,3,9,4],[11,3,11,4],[1,0,2,0],[1,1,2,1],[1,3,1,6],[3,0,4,0],[3,1,4,1],[3,3,3,4]]}
[]
["Sieve Size","JMF %Passing",null,"Asphalt Film Thickness"]
[]
["Max Size Agg",100,null,"Surface Area of Agg.",null,{"$f":"(2*B4+2*B6+4*B7+8*B8+14*B9+30*B10+60*B11+160*B12)/100","v":2},"Sq.ft/lb"]
[]
[4,{"$f":"'TR 448A'!J33","v":0},null,"Total Volume of AC",null,{"$f":"((B16*1000)*(B14/100)/B15)","v":0},"ml"]
[8,{"$f":"'TR 448A'!I33","v":0}]
[16,{"$f":"'TR 448A'!H33","v":0},null,"Volume of abs. AC",null,{"$f":"B24/B15","v":{"$error":"#DIV/0!"}},"ml"]
[30,{"$f":"'TR 448A'!G33","v":0}]
[50,{"$f":"'TR 448A'!F33","v":0},null," Vol. of Effective AC",null,{"$f":"F6-F8","v":{"$error":"#DIV/0!"}},"ml"]
[100,{"$f":"'TR 448A'!E33","v":0}]
[200,{"$f":"'TR 448A'!D33","v":0},null,"Film Thickness",null,{"$f":"F10/(C23*(B16*1000)*(100-B14)/100)*(1000)","v":{"$error":"#DIV/0!"}},"microns"]
[]
["AC",{"$f":"'TR 448A'!C33","v":0}]
["Gb",1.0249999999999999]
["Gmb",{"$f":"'TR 448A'!R41","v":0}]
["Gsb",{"$f":"'TR 448A'!A44","v":0}]
["Gse",{"$f":"F24","v":{"$error":"#DIV/0!"}}]
[]
[]
[]
[]
[{"$f":"(B18-B17)","v":{"$error":"#DIV/0!"}},{"$f":"(A23/A24)*B15","v":{"$error":"#DIV/0!"}},{"$f":"F4/4.8686","v":0.41079571129277415},null,"Max",{"$f":"'TR 448A'!O41","v":0}]
[{"$f":"B17*B18","v":{"$error":"#DIV/0!"}},{"$f":"B23*(B16*1000)*(100-B14)/100","v":{"$error":"#DIV/0!"}},null,null,"Gse",{"$f":"ROUND((100-B14)/((100/F23)-(B14/1.025)),3)","v":{"$error":"#DIV/0!"}}]
[null,null,null,null,"AC",{"$f":"B14","v":0}]

{"sheet":"Rap","index":17,"n_rows":42,"n_cols":28,"rows_kept":42,"cut":false,"hidden":false,"merged":[[31,25,31,26],[31,27,31,28],[32,25,32,26],[32,27,32,28],[39,25,39,26],[39,27,39,28],[40,25,40,26],[40,27,40,28],[41,25,41,26],[41,27,41,28],[36,25,36,26],[36,27,36,28],[37,25,37,26],[37,27,37,28],[38,25,38,26],[38,27,38,28],[38,23,38,24],[39,23,39,24],[40,23,40,24],[41,23,41,24],[26,25,27,26],[26,27,27,28],[28,27,28,28],[28,25,28,26],[29,25,29,26],[29,27,29,28],[32,23,32,24],[33,23,33,24],[34,23,34,24],[35,23,35,24],[36,23,36,24],[37,23,37,24],[33,25,33,26],[33,27,33,28],[34,25,34,26],[34,27,34,28],[35,25,35,26],[35,27,35,28],[30,25,30,26],[30,27,30,28],[41,15,41,16],[41,17,41,18],[41,19,41,20],[41,21,41,22],[26,23,27,24],[26,3,26,22],[28,23,28,24],[29,23,29,24],[30,23,30,24],[31,23,31,24],[40,15,40,16],[40,17,40,18],[40,19,40,20],[40,21,40,22],[41,3,41,4],[41,5,41,6],[41,7,41,8],[41,9,41,10],[41,11,41,12],[41,13,41,14],[39,15,39,16],[39,17,39,18],[39,19,39,20],[39,21,39,22],[40,3,40,4],[40,5,40,6],[40,7,40,8],[40,9,40,10],[40,11,40,12],[40,13,40,14],[38,15,38,16],[38,17,38,18],[38,19,38,20],[36,21,36,22],[37,3,37,4],[37,5,37,6],[37,7,37,8],[37,9,37,10],[37,11,37,12],[37,13,37,14],[38,21,38,22],[39,3,39,4],[39,5,39,6],[39,7,39,8],[39,9,39,10],[39,11,39,12],[39,13,39,14],[37,15,37,16],[37,17,37,18],[37,19,37,20],[37,21,37,22],[38,3,38,4],[38,5,38,6],[38,7,38,8],[38,9,38,10],[38,11,38,12],[38,13,38,14],[36,3,36,4],[36,5,36,6],[36,7,36,8],[36,9,36,10],[36,11,36,12],[36,13,36,14],[36,15,36,16],[36,17,36,18],[36,19,36,20],[34,21,34,22],[35,3,35,4],[35,5,35,6],[35,7,35,8],[35,9,35,10],[35,11,35,12],[35,13,35,14],[35,15,35,16],[35,17,35,18],[35,19,35,20],[35,21,35,22],[34,3,34,4],[34,5,34,6],[34,7,34,8],[34,9,34,10],[34,11,34,12],[34,13,34,14],[34,15,34,16],[34,17,34,18],[34,19,34,20],[32,21,32,22],[33,3,33,4],[33,5,33,6],[33,7,33,8],[33,9,33,10],[33,11,33,12],[33,13,33,14],[33,15,33,16],[33,17,33,18],[33,19,33,20],[33,21,33,22],[32,3,32,4],[32,5,32,6],[32,7,32,8],[32,9,32,10],[32,11,32,12],[32,13,32,14],[32,15,32,16],[32,17,32,18],[32,19,32,20],[30,21,30,22],[31,3,31,4],[31,5,31,6],[31,7,31,8],[31,9,31,10],[31,11,31,12],[31,13,31,14],[31,15,31,16],[31,17,31,18],[31,19,31,20],[31,21,31,22],[30,3,30,4],[30,5,30,6],[30,7,30,8],[30,9,30,10],[30,11,30,12],[30,13,30,14],[30,15,30,16],[30,17,30,18],[30,19,30,20],[28,17,28,18],[28,19,28,20],[28,21,28,22],[29,3,29,4],[29,5,29,6],[29,7,29,8],[29,9,29,10],[29,11,29,12],[29,13,29,14],[28,3,28,4],[28,5,28,6],[28,7,28,8],[28,9,28,10],[28,11,28,12],[28,13,28,14],[29,15,29,16],[29,17,29,18],[29,19,29,20],[29,21,29,22],[28,1,28,2],[41,1,41,2],[27,21,27,22],[27,19,27,20],[27,17,27,18],[27,15,27,16],[27,13,27,14],[27,11,27,12],[27,9,27,10],[27,7,27,8],[34,1,34,2],[33,1,33,2],[32,1,32,2],[31,1,31,2],[30,1,30,2],[29,1,29,2],[26,1,27,2],[40,1,40,2],[39,1,39,2],[38,1,38,2],[37,1,37,2],[36,1,36,2],[35,1,35,2],[28,15,28,16],[22,9,22,16],[24,1,24,24],[27,5,27,6],[27,3,27,4],[19,3,19,6],[20,3,20,6],[21,3,21,6],[22,3,22,6],[22,7,22,8],[21,7,21,8],[20,7,20,8],[19,7,19,8],[17,1,17,24],[15,13,15,14],[15,9,15,12],[12,11,12,12],[12,9,12,10],[12,7,12,8],[11,7,11,8],[11,9,11,10],[11,11,11,12],[14,3,14,6],[14,13,14,14],[14,11,14,12],[14,9,14,10],[14,7,14,8],[13,13,13,14],[11,13,11,14],[13,3,13,6],[13,11,13,12],[13,9,13,10],[13,7,13,8],[10,13,10,14],[10,11,10,12],[10,9,10,10],[10,7,10,8],[7,1,7,24],[9,3,9,6],[10,3,10,6],[11,3,11,6],[12,3,12,6],[12,13,12,14],[9,7,9,8],[9,9,9,10],[9,11,9,12],[9,13,9,14],[0,1,0,2],[3,2,3,4],[3,5,3,8],[3,9,3,14],[5,19,5,21],[5,26,5,27],[4,26,4,27],[3,26,3,27],[5,2,5,4],[5,5,5,7],[5,9,5,14],[5,15,5,17],[2,1,2,28],[5,22,5,25],[4,22,4,25],[4,2,4,4],[4,5,4,8],[4,9,4,14],[4,15,4,17],[4,20,4,21],[3,22,3,25],[3,15,3,18]]}
[null,{"$f":"Setup!A2","v":"ESB-19"}]
[]
[null,"Maximum Specific Gravity and Gse of Rap "]
[null,null,"Producer;",null,null,{"$f":"Setup!E7","v":0},null,null,null,"Material Class:",null,null,null,null,null,{"$f":"Setup!E10","v":0},null,null,null,null,null,null,"Nominal Sixe Agg:",null,null,null,{"$f":"Setup!E9","v":0}]
[null,null,"Designed By:",null,null,{"$f":"Setup!E8","v":0},null,null,null,"Esals:",null,null,null,null,null,{"$f":"Setup!E12","v":0},null,null,null,null,null,null,"SRL:",null,null,null,{"$f":"Setup!E11","v":0}]
[null,null,"Date:",null,null,{"$f":"Setup!E6","v":"00:00:00"},null,null,null,"Rap:",null,null,null,null,null,{"$f":"Setup!E17","v":0},null,null,null,null,null,null,"PG Grade:",null,null,null,{"$f":"Setup!E14","v":0}]
[]
[null,"Maximum Specific Gravity of Rap"]
[]
[null,null,null,"Sample No",null,null,null,"1",null,2,null,3,null,4]
[null,null,null,"Dry Wt. of Sample"]
[null,null,null,{"$f":"IF(Setup!$E$19=\"Suspension\",\"Mass of Pyc in Water\",\"Mass of Pyc + Water\")","v":"Mass of Pyc + Water"},null,null,null,{"$f":"IF(H11,Setup!$F$20,\"\")","v":""},null,{"$f":"IF(J11,Setup!$F$20,\"\")","v":""},null,{"$f":"IF(L11,Setup!$F$20,\"\")","v":""},null,{"$f":"IF(N11,Setup!$F$20,\"\")","v":""}]
[null,null,null,{"$f":"IF(Setup!F19=\"Suspension\",\"Mass samp+Pyc in H2O\",\"Mass Pyc + Mix + Water\")","v":"Mass samp+Pyc in H2O"}]
[null,null,null,"Vol Voidless Mix",null,null,null,{"$f":"IF(H13,ROUND(H11+H12-H13,1),\" \")","v":" "},null,{"$f":"IF(J13,ROUND(J11+J12-J13,1),\" \")","v":" "},null,{"$f":"IF(L13,ROUND(L11+L12-L13,1),\" \")","v":" "},null,{"$f":"IF(N13,ROUND(N11+N12-N13,1),\" \")","v":" "}]
[null,null,null,"Max Sp Gr of Mix",null,null,null,{"$f":"IF(H13,ROUND(H11/H14,3),\" \")","v":" "},null,{"$f":"IF(J13,ROUND(J11/J14,3),\" \")","v":" "},null,{"$f":"IF(L13,ROUND(L11/L14,3),\" \")","v":" "},null,{"$f":"IF(N13,ROUND(N11/N14,3),\" \")","v":" "}]
[null,null,null,null,null,null,null,null,null,"Average",null,null,null,{"$f":"IF(H13,AVERAGE(H15:O15),\"\")","v":""}]
[]
[null,"Effective Specific Gravity Rap Aggregate to be used on Agg blend forms"]
[]
[null,null,null,"Max. Sp. Gr. Of Rap",null,null,null,{"$f":"N16","v":""}]
[null,null,null,"% AC in Rap"]
[null,null,null,"Sp Gr. Of Binder",null,null,null,1.03]
[null,null,null,"Gse",null,null,null,{"$f":"IF(H21,(100-H21)/(100/H20-H21/H22),\"\")","v":""},null,"Value to be used on Agg Blend Form"]
[]
[null,"Rap Data"]
[]
[null,"Sieve Size",null,"Rap gradation and Asphalt Content",null,null,null,null,null,null,null,null,null,null,null,null,null,null,null,null,null,null,null,"Average",null,"Combined Grade",null,"Proposed JMF"]
[null,null,null,1,null,2,null,3,null,4,null,5,null,6,null,7,null,8,null,9,null,10]
[null,"2\"",null,null,null,null,null,null,null,null,null,null,null,null,null,null,null,null,null,null,null,null,null,{"$f":"IF(D29,AVERAGE(D29:W29),\"\")","v":""}]
[null,"1 1/2\"",null,null,null,null,null,null,null,null,null,null,null,null,null,null,null,null,null,null,null,null,null,{"$f":"IF(D30,AVERAGE(D30:W30),\"\")","v":""}]
[null,"1\"",null,null,null,null,null,null,null,null,null,null,null,null,null,null,null,null,null,null,null,null,null,""]
[null,"3/4\"",null,null,null,null,null,null,null,null,null,null,null,null,null,null,null,null,null,null,null,null,null,""]
[null,"1/2\"",null,null,null,null,null,null,null,null,null,null,null,null,null,null,null,null,null,null,null,null,null,""]
[null,"3/8\"",null,null,null,null,null,null,null,null,null,null,null,null,null,null,null,null,null,null,null,null,null,""]
[null,"#4",null,null,null,null,null,null,null,null,null,null,null,null,null,null,null,null,null,null,null,null,null,""]
[null,"#8",null,null,null,null,null,null,null,null,null,null,null,null,null,null,null,null,null,null,null,null,null,""]
[null,"#16",null,null,null,null,null,null,null,null,null,null,null,null,null,null,null,null,null,null,null,null,null,""]
[null,"#30",null,null,null,null,null,null,null,null,null,null,null,null,null,null,null,null,null,null,null,null,null,""]
[null,"#50",null,null,null,null,null,null,null,null,null,null,null,null,null,null,null,null,null,null,null,null,null,""]
[null,"#100",null,null,null,null,null,null,null,null,null,null,null,null,null,null,null,null,null,null,null,null,null,""]
[null,"#200",null,null,null,null,null,null,null,null,null,null,null,null,null,null,null,null,null,null,null,null,null,""]
[null,"Asphalt",null,null,null,null,null,null,null,null,null,null,null,null,null,null,null,null,null,null,null,null,null,""]

{"sheet":"Blend 1","index":18,"n_rows":46,"n_cols":25,"rows_kept":46,"cut":false,"hidden":false,"merged":[[3,8,3,9],[4,8,4,9],[3,6,3,7],[7,0,7,14],[5,13,5,14],[4,13,4,14],[5,6,5,7],[4,6,4,7],[3,13,3,14],[5,11,5,12],[4,11,4,12],[3,11,3,12],[5,8,5,9],[0,0,0,1],[29,4,29,5],[30,1,31,1],[30,2,31,2],[30,10,30,11],[9,4,9,5],[10,1,11,1],[10,2,11,2],[10,10,10,11],[2,0,2,14],[3,0,3,1],[4,0,4,1],[5,0,5,1],[3,2,3,3],[4,2,4,3],[5,2,5,3]]}
[{"$f":"Setup!A2","v":"ESB-19"}]
[]
["Blend Sheet 1"]
["Producer;",null,{"$f":"Setup!E7","v":0},null,null,null,"Material Class:",null,{"$f":"Setup!E10","v":0},null,null,"Nominal Size:",null,{"$f":"Setup!E9","v":0}]
["Designed By:",null,{"$f":"Setup!E8","v":0},null,null,null,"Esals:",null,{"$f":"Setup!E12","v":0},null,null,"SRL:",null,{"$f":"Setup!E11","v":0}]
["Date:",null,{"$f":"Setup!E6","v":"00:00:00"},null,null,null,"Rap:",null,{"$f":"Setup!E17","v":0},null,null,"PG Grade:",null,{"$f":"Setup!E14","v":0}]
[]
["Blend 1"]
[]
[null,null,null,null,"Gmb Specimen"]
[null,"Individual Weights","Cumulative Weights",null,null,null,null,null,null,null,"Total Aggregate Wt"]
["Sieve",null,null,{"$f":"'Agg Blends'!$I$10","v":0},{"$f":"'Agg Blends'!$I$11","v":0},{"$f":"'Agg Blends'!$I$12","v":0},{"$f":"'Agg Blends'!$I$13","v":0},{"$f":"'Agg Blends'!$I$14","v":0},{"$f":"'Agg Blends'!$I$15","v":0},{"$f":"'Agg Blends'!$I$16","v":0},null,null,null,null,null,null,null,null,1,2,3,4,5,6,7]
[50,{"$f":"C13-C14","v":0},{"$f":"IF(SUM(D13:J13)=0,0,SUM(D13:J13)+$K$26)","v":0},{"$f":"S13","v":0},0,0,0,0,0,0,"Binder %",null,null,null,null,null,null,{"$f":"(C13/$M$11)*100","v":{"$error":"#DIV/0!"}},{"$f":"('Agg Blends'!D20/100)*('Agg Blends'!$K$10/100)*($M$11-$K$26)","v":0},{"$f":"('Agg Blends'!E20/100)*('Agg Blends'!$K$11/100)*($M$11-$K$26)","v":0},{"$f":"('Agg Blends'!F20/100)*('Agg Blends'!$K$12/100)*($M$11-$K$26)","v":0},{"$f":"('Agg Blends'!G20/100)*('Agg Blends'!$K$13/100)*($M$11-$K$26)","v":0},{"$f":"('Agg Blends'!H20/100)*('Agg Blends'!$K$14/100)*($M$11-$K$26)","v":0},{"$f":"('Agg Blends'!I20/100)*('Agg Blends'!$K$15/100)*($M$11-$K$26)","v":0},{"$f":"('Agg Blends'!J20/100)*('Agg Blends'!$K$16/100)*($M$11-$K$26)","v":0}]
[37.5,0,0,0,0,0,0,0,0,0,"Agg Wt",{"$f":"M11","v":0},{"$f":"M11","v":0},{"$f":"M11","v":0},{"$f":"M11","v":0},null,null,{"$f":"(C14/$M$11)*100","v":{"$error":"#DIV/0!"}},{"$f":"('Agg Blends'!D21/100)*('Agg Blends'!$K$10/100)*($M$11-$K$26)","v":0},{"$f":"('Agg Blends'!E21/100)*('Agg Blends'!$K$11/100)*($M$11-$K$26)","v":0},{"$f":"('Agg Blends'!F21/100)*('Agg Blends'!$K$12/100)*($M$11-$K$26)","v":0},{"$f":"('Agg Blends'!G21/100)*('Agg Blends'!$K$13/100)*($M$11-$K$26)","v":0},{"$f":"('Agg Blends'!H21/100)*('Agg Blends'!$K$14/100)*($M$11-$K$26)","v":0},{"$f":"('Agg Blends'!I21/100)*('Agg Blends'!$K$15/100)*($M$11-$K$26)","v":0},{"$f":"('Agg Blends'!J21/100)*('Agg Blends'!$K$16/100)*($M$11-$K$26)","v":0}]
[25,0,0,{"$f":"S15","v":0},0,0,0,0,0,0,"Binder Wt",{"$f":"L16-L14","v":0},{"$f":"M16-M14","v":0},{"$f":"N16-N14","v":0},{"$f":"O16-O14","v":0},null,null,{"$f":"(C15/$M$11)*100","v":{"$error":"#DIV/0!"}},{"$f":"('Agg Blends'!D22/100)*('Agg Blends'!$K$10/100)*($M$11-$K$26)","v":0},{"$f":"('Agg Blends'!E22/100)*('Agg Blends'!$K$11/100)*($M$11-$K$26)","v":0},{"$f":"('Agg Blends'!F22/100)*('Agg Blends'!$K$12/100)*($M$11-$K$26)","v":0},{"$f":"('Agg Blends'!G22/100)*('Agg Blends'!$K$13/100)*($M$11-$K$26)","v":0},{"$f":"('Agg Blends'!H22/100)*('Agg Blends'!$K$14/100)*($M$11-$K$26)","v":0},{"$f":"('Agg Blends'!I22/100)*('Agg Blends'!$K$15/100)*($M$11-$K$26)","v":0},{"$f":"('Agg Blends'!J22/100)*('Agg Blends'!$K$16/100)*($M$11-$K$26)","v":0}]
[19,0,0,0,0,0,0,0,0,0,"Total Wt",{"$f":"(L14/(100-L13))*100","v":0},{"$f":"(M14/(100-M13))*100","v":0},{"$f":"(N14/(100-N13))*100","v":0},{"$f":"(O14/(100-O13))*100","v":0},null,null,{"$error":"#DIV/0!"},{"$f":"('Agg Blends'!D23/100)*('Agg Blends'!$K$10/100)*($M$11-$K$26)","v":0},{"$f":"('Agg Blends'!E23/100)*('Agg Blends'!$K$11/100)*($M$11-$K$26)","v":0},{"$f":"('Agg Blends'!F23/100)*('Agg Blends'!$K$12/100)*($M$11-$K$26)","v":0},{"$f":"('Agg Blends'!G23/100)*('Agg Blends'!$K$13/100)*($M$11-$K$26)","v":0},{"$f":"('Agg Blends'!H23/100)*('Agg Blends'!$K$14/100)*($M$11-$K$26)","v":0},{"$f":"('Agg Blends'!I23/100)*('Agg Blends'!$K$15/100)*($M$11-$K$26)","v":0},{"$f":"('Agg Blends'!J23/100)*('Agg Blends'!$K$16/100)*($M$11-$K$26)","v":0}]
[12.5,0,0,0,0,0,0,0,0,0,null,null,null,null,null,null,null,{"$error":"#DIV/0!"},{"$f":"('Agg Blends'!D24/100)*('Agg Blends'!$K$10/100)*($M$11-$K$26)","v":0},{"$f":"('Agg Blends'!E24/100)*('Agg Blends'!$K$11/100)*($M$11-$K$26)","v":0},{"$f":"('Agg Blends'!F24/100)*('Agg Blends'!$K$12/100)*($M$11-$K$26)","v":0},{"$f":"('Agg Blends'!G24/100)*('Agg Blends'!$K$13/100)*($M$11-$K$26)","v":0},{"$f":"('Agg Blends'!H24/100)*('Agg Blends'!$K$14/100)*($M$11-$K$26)","v":0},{"$f":"('Agg Blends'!I24/100)*('Agg Blends'!$K$15/100)*($M$11-$K$26)","v":0},{"$f":"('Agg Blends'!J24/100)*('Agg Blends'!$K$16/100)*($M$11-$K$26)","v":0}]
[9.5,{"$f":"C18-C19","v":0},0,0,0,0,0,0,0,0,null,null,null,null,null,null,null,{"$error":"#DIV/0!"},{"$f":"('Agg Blends'!D25/100)*('Agg Blends'!$K$10/100)*($M$11-$K$26)","v":0},{"$f":"('Agg Blends'!E25/100)*('Agg Blends'!$K$11/100)*($M$11-$K$26)","v":0},{"$f":"('Agg Blends'!F25/100)*('Agg Blends'!$K$12/100)*($M$11-$K$26)","v":0},{"$f":"('Agg Blends'!G25/100)*('Agg Blends'!$K$13/100)*($M$11-$K$26)","v":0},{"$f":"('Agg Blends'!H25/100)*('Agg Blends'!$K$14/100)*($M$11-$K$26)","v":0},{"$f":"('Agg Blends'!I25/100)*('Agg Blends'!$K$15/100)*($M$11-$K$26)","v":0},{"$f":"('Agg Blends'!J25/100)*('Agg Blends'!$K$16/100)*($M$11-$K$26)","v":0}]
[6.33,{"$f":"C19-C20","v":0},0,{"$f":"S19","v":0},{"$f":"T19","v":0},{"$f":"U19","v":0},{"$f":"V19","v":0},{"$f":"W19","v":0},{"$f":"X19","v":0},{"$f":"Y19","v":0},null,null,null,null,null,null,null,{"$error":"#DIV/0!"},{"$f":"('Agg Blends'!D26/100)*('Agg Blends'!$K$10/100)*($M$11-$K$26)","v":0},{"$f":"('Agg Blends'!E26/100)*('Agg Blends'!$K$11/100)*($M$11-$K$26)","v":0},{"$f":"('Agg Blends'!F26/100)*('Agg Blends'!$K$12/100)*($M$11-$K$26)","v":0},{"$f":"('Agg Blends'!G26/100)*('Agg Blends'!$K$13/100)*($M$11-$K$26)","v":0},{"$f":"('Agg Blends'!H26/100)*('Agg Blends'!$K$14/100)*($M$11-$K$26)","v":0},{"$f":"('Agg Blends'!I26/100)*('Agg Blends'!$K$15/100)*($M$11-$K$26)","v":0},{"$f":"('Agg Blends'!J26/100)*('Agg Blends'!$K$16/100)*($M$11-$K$26)","v":0}]
[4.75,0,0,0,0,0,0,0,0,0,null,null,null,null,null,null,null,{"$f":"(C20/$M$11)*100","v":{"$error":"#DIV/0!"}},{"$f":"('Agg Blends'!D27/100)*('Agg Blends'!$K$10/100)*($M$11-$K$26)","v":0},{"$f":"('Agg Blends'!E27/100)*('Agg Blends'!$K$11/100)*($M$11-$K$26)","v":0},{"$f":"('Agg Blends'!F27/100)*('Agg Blends'!$K$12/100)*($M$11-$K$26)","v":0},{"$f":"('Agg Blends'!G27/100)*('Agg Blends'!$K$13/100)*($M$11-$K$26)","v":0},{"$f":"('Agg Blends'!H27/100)*('Agg Blends'!$K$14/100)*($M$11-$K$26)","v":0},{"$f":"('Agg Blends'!I27/100)*('Agg Blends'!$K$15/100)*($M$11-$K$26)","v":0},{"$f":"('Agg Blends'!J27/100)*('Agg Blends'!$K$16/100)*($M$11-$K$26)","v":0}]
[2.36,0,0,0,0,0,0,0,0,0,null,null,null,null,null,null,null,{"$error":"#DIV/0!"},{"$f":"('Agg Blends'!D28/100)*('Agg Blends'!$K$10/100)*($M$11-$K$26)","v":0},{"$f":"('Agg Blends'!E28/100)*('Agg Blends'!$K$11/100)*($M$11-$K$26)","v":0},{"$f":"('Agg Blends'!F28/100)*('Agg Blends'!$K$12/100)*($M$11-$K$26)","v":0},{"$f":"('Agg Blends'!G28/100)*('Agg Blends'!$K$13/100)*($M$11-$K$26)","v":0},{"$f":"('Agg Blends'!H28/100)*('Agg Blends'!$K$14/100)*($M$11-$K$26)","v":0},{"$f":"('Agg Blends'!I28/100)*('Agg Blends'!$K$15/100)*($M$11-$K$26)","v":0},{"$f":"('Agg Blends'!J28/100)*('Agg Blends'!$K$16/100)*($M$11-$K$26)","v":0}]
[1.18,0,0,0,0,0,0,0,0,0,null,null,null,null,null,null,null,{"$error":"#DIV/0!"},{"$f":"('Agg Blends'!D29/100)*('Agg Blends'!$K$10/100)*($M$11-$K$26)","v":0},{"$f":"('Agg Blends'!E29/100)*('Agg Blends'!$K$11/100)*($M$11-$K$26)","v":0},{"$f":"('Agg Blends'!F29/100)*('Agg Blends'!$K$12/100)*($M$11-$K$26)","v":0},{"$f":"('Agg Blends'!G29/100)*('Agg Blends'!$K$13/100)*($M$11-$K$26)","v":0},{"$f":"('Agg Blends'!H29/100)*('Agg Blends'!$K$14/100)*($M$11-$K$26)","v":0},{"$f":"('Agg Blends'!I29/100)*('Agg Blends'!$K$15/100)*($M$11-$K$26)","v":0},{"$f":"('Agg Blends'!J29/100)*('Agg Blends'!$K$16/100)*($M$11-$K$26)","v":0}]
[0.6,0,0,0,0,0,0,0,0,0,null,null,null,null,null,null,null,{"$error":"#DIV/0!"},{"$f":"('Agg Blends'!D30/100)*('Agg Blends'!$K$10/100)*($M$11-$K$26)","v":0},{"$f":"('Agg Blends'!E30/100)*('Agg Blends'!$K$11/100)*($M$11-$K$26)","v":0},{"$f":"('Agg Blends'!F30/100)*('Agg Blends'!$K$12/100)*($M$11-$K$26)","v":0},{"$f":"('Agg Blends'!G30/100)*('Agg Blends'!$K$13/100)*($M$11-$K$26)","v":0},{"$f":"('Agg Blends'!H30/100)*('Agg Blends'!$K$14/100)*($M$11-$K$26)","v":0},{"$f":"('Agg Blends'!I30/100)*('Agg Blends'!$K$15/100)*($M$11-$K$26)","v":0},{"$f":"('Agg Blends'!J30/100)*('Agg Blends'!$K$16/100)*($M$11-$K$26)","v":0}]
[0.3,0,0,0,0,0,0,0,0,0,null,null,null,null,null,null,null,{"$error":"#DIV/0!"},{"$f":"('Agg Blends'!D31/100)*('Agg Blends'!$K$10/100)*($M$11-$K$26)","v":0},{"$f":"('Agg Blends'!E31/100)*('Agg Blends'!$K$11/100)*($M$11-$K$26)","v":0},{"$f":"('Agg Blends'!F31/100)*('Agg Blends'!$K$12/100)*($M$11-$K$26)","v":0},{"$f":"('Agg Blends'!G31/100)*('Agg Blends'!$K$13/100)*($M$11-$K$26)","v":0},{"$f":"('Agg Blends'!H31/100)*('Agg Blends'!$K$14/100)*($M$11-$K$26)","v":0},{"$f":"('Agg Blends'!I31/100)*('Agg Blends'!$K$15/100)*($M$11-$K$26)","v":0},{"$f":"('Agg Blends'!J31/100)*('Agg Blends'!$K$16/100)*($M$11-$K$26)","v":0}]
[0.15,{"$f":"C25-C26","v":0},0,0,0,0,0,0,0,0,"Baghouse #200",null,null,null,null,null,null,{"$error":"#DIV/0!"},{"$f":"('Agg Blends'!D32/100)*('Agg Blends'!$K$10/100)*($M$11-$K$26)","v":0},{"$f":"('Agg Blends'!E32/100)*('Agg Blends'!$K$11/100)*($M$11-$K$26)","v":0},{"$f":"('Agg Blends'!F32/100)*('Agg Blends'!$K$12/100)*($M$11-$K$26)","v":0},{"$f":"('Agg Blends'!G32/100)*('Agg Blends'!$K$13/100)*($M$11-$K$26)","v":0},{"$f":"('Agg Blends'!H32/100)*('Agg Blends'!$K$14/100)*($M$11-$K$26)","v":0},{"$f":"('Agg Blends'!I32/100)*('Agg Blends'!$K$15/100)*($M$11-$K$26)","v":0},{"$f":"('Agg Blends'!J32/100)*('Agg Blends'!$K$16/100)*($M$11-$K$26)","v":0}]
[7.4999999999999997E-2,{"$f":"C26","v":0},0,0,0,0,0,0,0,0,{"$f":"('Agg Blends'!K34/100)*($M$11)","v":0},null,null,null,null,null,null,{"$error":"#DIV/0!"},{"$f":"('Agg Blends'!D33/100)*('Agg Blends'!$K$10/100)*($M$11-$K$26)","v":0},{"$f":"('Agg Blends'!E33/100)*('Agg Blends'!$K$11/100)*($M$11-$K$26)","v":0},{"$f":"('Agg Blends'!F33/100)*('Agg Blends'!$K$12/100)*($M$11-$K$26)","v":0},{"$f":"('Agg Blends'!G33/100)*('Agg Blends'!$K$13/100)*($M$11-$K$26)","v":0},{"$f":"('Agg Blends'!H33/100)*('Agg Blends'!$K$14/100)*($M$11-$K$26)","v":0},{"$f":"('Agg Blends'!I33/100)*('Agg Blends'!$K$15/100)*($M$11-$K$26)","v":0},{"$f":"('Agg Blends'!J33/100)*('Agg Blends'!$K$16/100)*($M$11-$K$26)","v":0}]
[]
[]
[]
[null,null,null,null,"Gmm Specimen"]
[null,"Individual Weights","Cumulative Weights",null,null,null,null,null,null,null,"Total Aggregate Wt"]
["Sieve",null,null,{"$f":"'Agg Blends'!$I$10","v":0},{"$f":"'Agg Blends'!$I$11","v":0},{"$f":"'Agg Blends'!$I$12","v":0},{"$f":"'Agg Blends'!$I$13","v":0},{"$f":"'Agg Blends'!$I$14","v":0},{"$f":"'Agg Blends'!$I$15","v":0},{"$f":"'Agg Blends'!$I$15","v":0},null,null,null,null,null,null,null,null,1,2,3,4,5,6,7]
[50,{"$f":"C33-C34","v":0},{"$f":"IF(SUM(D33:J33)=0,0,SUM(D33:J33)+$K$46)","v":0},{"$f":"S33","v":0},0,0,0,0,0,0,"Binder %",null,null,null,null,null,null,{"$f":"(C33/$M$31)*100","v":{"$error":"#DIV/0!"}},{"$f":"('Agg Blends'!D20/100)*('Agg Blends'!$K$10/100)*($M$31-$K$46)","v":0},{"$f":"('Agg Blends'!E20/100)*('Agg Blends'!$K$11/100)*($M$31-$K$46)","v":0},{"$f":"('Agg Blends'!F20/100)*('Agg Blends'!$K$12/100)*($M$31-$K$46)","v":0},{"$f":"('Agg Blends'!G20/100)*('Agg Blends'!$K$13/100)*($M$31-$K$46)","v":0},{"$f":"('Agg Blends'!H20/100)*('Agg Blends'!$K$14/100)*($M$31-$K$46)","v":0},{"$f":"('Agg Blends'!I20/100)*('Agg Blends'!$K$15/100)*($M$31-$K$46)","v":0},{"$f":"('Agg Blends'!J20/100)*('Agg Blends'!$K$16/100)*($M$31-$K$46)","v":0}]
[37.5,0,{"$f":"IF(SUM(D34:J34)=0,0,SUM(D34:J34)+$K$46)","v":0},0,0,0,0,0,0,0,"Agg Wt",{"$f":"M31","v":0},{"$f":"M31","v":0},{"$f":"M31","v":0},{"$f":"M31","v":0},null,null,{"$f":"(C34/$M$31)*100","v":{"$error":"#DIV/0!"}},{"$f":"('Agg Blends'!D21/100)*('Agg Blends'!$K$10/100)*($M$31-$K$46)","v":0},{"$f":"('Agg Blends'!E21/100)*('Agg Blends'!$K$11/100)*($M$31-$K$46)","v":0},{"$f":"('Agg Blends'!F21/100)*('Agg Blends'!$K$12/100)*($M$31-$K$46)","v":0},{"$f":"('Agg Blends'!G21/100)*('Agg Blends'!$K$13/100)*($M$31-$K$46)","v":0},{"$f":"('Agg Blends'!H21/100)*('Agg Blends'!$K$14/100)*($M$31-$K$46)","v":0},{"$f":"('Agg Blends'!I21/100)*('Agg Blends'!$K$15/100)*($M$31-$K$46)","v":0},{"$f":"('Agg Blends'!J21/100)*('Agg Blends'!$K$16/100)*($M$31-$K$46)","v":0}]
[25,0,0,0,0,0,0,0,0,0,"Binder Wt",{"$f":"L36-L34","v":0},{"$f":"M36-M34","v":0},{"$f":"N36-N34","v":0},{"$f":"O36-O34","v":0},null,null,{"$error":"#DIV/0!"},{"$f":"('Agg Blends'!D22/100)*('Agg Blends'!$K$10/100)*($M$31-$K$46)","v":0},{"$f":"('Agg Blends'!E22/100)*('Agg Blends'!$K$11/100)*($M$31-$K$46)","v":0},{"$f":"('Agg Blends'!F22/100)*('Agg Blends'!$K$12/100)*($M$31-$K$46)","v":0},{"$f":"('Agg Blends'!G22/100)*('Agg Blends'!$K$13/100)*($M$31-$K$46)","v":0},{"$f":"('Agg Blends'!H22/100)*('Agg Blends'!$K$14/100)*($M$31-$K$46)","v":0},{"$f":"('Agg Blends'!I22/100)*('Agg Blends'!$K$15/100)*($M$31-$K$46)","v":0},{"$f":"('Agg Blends'!J22/100)*('Agg Blends'!$K$16/100)*($M$31-$K$46)","v":0}]
[19,0,0,0,0,0,0,0,0,0,"Total Wt",{"$f":"(L34/(100-L33))*100","v":0},{"$f":"(M34/(100-M33))*100","v":0},{"$f":"(N34/(100-N33))*100","v":0},{"$f":"(O34/(100-O33))*100","v":0},null,null,{"$error":"#DIV/0!"},{"$f":"('Agg Blends'!D23/100)*('Agg Blends'!$K$10/100)*($M$31-$K$46)","v":0},{"$f":"('Agg Blends'!E23/100)*('Agg Blends'!$K$11/100)*($M$31-$K$46)","v":0},{"$f":"('Agg Blends'!F23/100)*('Agg Blends'!$K$12/100)*($M$31-$K$46)","v":0},{"$f":"('Agg Blends'!G23/100)*('Agg Blends'!$K$13/100)*($M$31-$K$46)","v":0},{"$f":"('Agg Blends'!H23/100)*('Agg Blends'!$K$14/100)*($M$31-$K$46)","v":0},{"$f":"('Agg Blends'!I23/100)*('Agg Blends'!$K$15/100)*($M$31-$K$46)","v":0},{"$f":"('Agg Blends'!J23/100)*('Agg Blends'!$K$16/100)*($M$31-$K$46)","v":0}]
[12.5,0,0,0,0,0,0,0,0,0,null,null,null,null,null,null,null,{"$error":"#DIV/0!"},{"$f":"('Agg Blends'!D24/100)*('Agg Blends'!$K$10/100)*($M$31-$K$46)","v":0},{"$f":"('Agg Blends'!E24/100)*('Agg Blends'!$K$11/100)*($M$31-$K$46)","v":0},{"$f":"('Agg Blends'!F24/100)*('Agg Blends'!$K$12/100)*($M$31-$K$46)","v":0},{"$f":"('Agg Blends'!G24/100)*('Agg Blends'!$K$13/100)*($M$31-$K$46)","v":0},{"$f":"('Agg Blends'!H24/100)*('Agg Blends'!$K$14/100)*($M$31-$K$46)","v":0},{"$f":"('Agg Blends'!I24/100)*('Agg Blends'!$K$15/100)*($M$31-$K$46)","v":0},{"$f":"('Agg Blends'!J24/100)*('Agg Blends'!$K$16/100)*($M$31-$K$46)","v":0}]
[9.5,{"$f":"C38-C39","v":0},{"$f":"IF(SUM(D38:J38)=0,0,SUM(D38:J38)+$K$46)","v":0},0,0,0,0,0,0,0,null,null,null,null,null,null,null,{"$f":"(C38/$M$31)*100","v":{"$error":"#DIV/0!"}},{"$f":"('Agg Blends'!D25/100)*('Agg Blends'!$K$10/100)*($M$31-$K$46)","v":0},{"$f":"('Agg Blends'!E25/100)*('Agg Blends'!$K$11/100)*($M$31-$K$46)","v":0},{"$f":"('Agg Blends'!F25/100)*('Agg Blends'!$K$12/100)*($M$31-$K$46)","v":0},{"$f":"('Agg Blends'!G25/100)*('Agg Blends'!$K$13/100)*($M$31-$K$46)","v":0},{"$f":"('Agg Blends'!H25/100)*('Agg Blends'!$K$14/100)*($M$31-$K$46)","v":0},{"$f":"('Agg Blends'!I25/100)*('Agg Blends'!$K$15/100)*($M$31-$K$46)","v":0},{"$f":"('Agg Blends'!J25/100)*('Agg Blends'!$K$16/100)*($M$31-$K$46)","v":0}]
[6.33,0,{"$f":"IF(SUM(D39:J39)=0,0,SUM(D39:J39)+$K$46)","v":0},{"$f":"S39","v":0},{"$f":"T39","v":0},{"$f":"U39","v":0},{"$f":"V39","v":0},{"$f":"W39","v":0},{"$f":"X39","v":0},{"$f":"Y39","v":0},null,null,null,null,null,null,null,{"$f":"(C39/$M$31)*100","v":{"$error":"#DIV/0!"}},{"$f":"('Agg Blends'!D26/100)*('Agg Blends'!$K$10/100)*($M$31-$K$46)","v":0},{"$f":"('Agg Blends'!E26/100)*('Agg Blends'!$K$11/100)*($M$31-$K$46)","v":0},{"$f":"('Agg Blends'!F26/100)*('Agg Blends'!$K$12/100)*($M$31-$K$46)","v":0},{"$f":"('Agg Blends'!G26/100)*('Agg Blends'!$K$13/100)*($M$31-$K$46)","v":0},{"$f":"('Agg Blends'!H26/100)*('Agg Blends'!$K$14/100)*($M$31-$K$46)","v":0},{"$f":"('Agg Blends'!I26/100)*('Agg Blends'!$K$15/100)*($M$31-$K$46)","v":0},{"$f":"('Agg Blends'!J26/100)*('Agg Blends'!$K$16/100)*($M$31-$K$46)","v":0}]
[4.75,0,0,0,0,0,0,0,0,0,null,null,null,null,null,null,null,{"$error":"#DIV/0!"},{"$f":"('Agg Blends'!D27/100)*('Agg Blends'!$K$10/100)*($M$31-$K$46)","v":0},{"$f":"('Agg Blends'!E27/100)*('Agg Blends'!$K$11/100)*($M$31-$K$46)","v":0},{"$f":"('Agg Blends'!F27/100)*('Agg Blends'!$K$12/100)*($M$31-$K$46)","v":0},{"$f":"('Agg Blends'!G27/100)*('Agg Blends'!$K$13/100)*($M$31-$K$46)","v":0},{"$f":"('Agg Blends'!H27/100)*('Agg Blends'!$K$14/100)*($M$31-$K$46)","v":0},{"$f":"('Agg Blends'!I27/100)*('Agg Blends'!$K$15/100)*($M$31-$K$46)","v":0},{"$f":"('Agg Blends'!J27/100)*('Agg Blends'!$K$16/100)*($M$31-$K$46)","v":0}]
[2.36,0,0,0,0,0,0,0,0,0,null,null,null,null,null,null,null,{"$error":"#DIV/0!"},{"$f":"('Agg Blends'!D28/100)*('Agg Blends'!$K$10/100)*($M$31-$K$46)","v":0},{"$f":"('Agg Blends'!E28/100)*('Agg Blends'!$K$11/100)*($M$31-$K$46)","v":0},{"$f":"('Agg Blends'!F28/100)*('Agg Blends'!$K$12/100)*($M$31-$K$46)","v":0},{"$f":"('Agg Blends'!G28/100)*('Agg Blends'!$K$13/100)*($M$31-$K$46)","v":0},{"$f":"('Agg Blends'!H28/100)*('Agg Blends'!$K$14/100)*($M$31-$K$46)","v":0},{"$f":"('Agg Blends'!I28/100)*('Agg Blends'!$K$15/100)*($M$31-$K$46)","v":0},{"$f":"('Agg Blends'!J28/100)*('Agg Blends'!$K$16/100)*($M$31-$K$46)","v":0}]
[1.18,0,0,0,0,0,0,0,0,0,null,null,null,null,null,null,null,{"$error":"#DIV/0!"},{"$f":"('Agg Blends'!D29/100)*('Agg Blends'!$K$10/100)*($M$31-$K$46)","v":0},{"$f":"('Agg Blends'!E29/100)*('Agg Blends'!$K$11/100)*($M$31-$K$46)","v":0},{"$f":"('Agg Blends'!F29/100)*('Agg Blends'!$K$12/100)*($M$31-$K$46)","v":0},{"$f":"('Agg Blends'!G29/100)*('Agg Blends'!$K$13/100)*($M$31-$K$46)","v":0},{"$f":"('Agg Blends'!H29/100)*('Agg Blends'!$K$14/100)*($M$31-$K$46)","v":0},{"$f":"('Agg Blends'!I29/100)*('Agg Blends'!$K$15/100)*($M$31-$K$46)","v":0},{"$f":"('Agg Blends'!J29/100)*('Agg Blends'!$K$16/100)*($M$31-$K$46)","v":0}]
[0.6,0,0,0,0,0,0,0,0,0,null,null,null,null,null,null,null,{"$error":"#DIV/0!"},{"$f":"('Agg Blends'!D30/100)*('Agg Blends'!$K$10/100)*($M$31-$K$46)","v":0},{"$f":"('Agg Blends'!E30/100)*('Agg Blends'!$K$11/100)*($M$31-$K$46)","v":0},{"$f":"('Agg Blends'!F30/100)*('Agg Blends'!$K$12/100)*($M$31-$K$46)","v":0},{"$f":"('Agg Blends'!G30/100)*('Agg Blends'!$K$13/100)*($M$31-$K$46)","v":0},{"$f":"('Agg Blends'!H30/100)*('Agg Blends'!$K$14/100)*($M$31-$K$46)","v":0},{"$f":"('Agg Blends'!I30/100)*('Agg Blends'!$K$15/100)*($M$31-$K$46)","v":0},{"$f":"('Agg Blends'!J30/100)*('Agg Blends'!$K$16/100)*($M$31-$K$46)","v":0}]
[0.3,0,0,0,0,0,0,0,0,0,null,null,null,null,null,null,null,{"$error":"#DIV/0!"},{"$f":"('Agg Blends'!D31/100)*('Agg Blends'!$K$10/100)*($M$31-$K$46)","v":0},{"$f":"('Agg Blends'!E31/100)*('Agg Blends'!$K$11/100)*($M$31-$K$46)","v":0},{"$f":"('Agg Blends'!F31/100)*('Agg Blends'!$K$12/100)*($M$31-$K$46)","v":0},{"$f":"('Agg Blends'!G31/100)*('Agg Blends'!$K$13/100)*($M$31-$K$46)","v":0},{"$f":"('Agg Blends'!H31/100)*('Agg Blends'!$K$14/100)*($M$31-$K$46)","v":0},{"$f":"('Agg Blends'!I31/100)*('Agg Blends'!$K$15/100)*($M$31-$K$46)","v":0},{"$f":"('Agg Blends'!J31/100)*('Agg Blends'!$K$16/100)*($M$31-$K$46)","v":0}]
[0.15,{"$f":"C45-C46","v":0},0,0,0,0,0,0,0,0,"Baghouse #200",null,null,null,null,null,null,{"$error":"#DIV/0!"},{"$f":"('Agg Blends'!D32/100)*('Agg Blends'!$K$10/100)*($M$31-$K$46)","v":0},{"$f":"('Agg Blends'!E32/100)*('Agg Blends'!$K$11/100)*($M$31-$K$46)","v":0},{"$f":"('Agg Blends'!F32/100)*('Agg Blends'!$K$12/100)*($M$31-$K$46)","v":0},{"$f":"('Agg Blends'!G32/100)*('Agg Blends'!$K$13/100)*($M$31-$K$46)","v":0},{"$f":"('Agg Blends'!H32/100)*('Agg Blends'!$K$14/100)*($M$31-$K$46)","v":0},{"$f":"('Agg Blends'!I32/100)*('Agg Blends'!$K$15/100)*($M$31-$K$46)","v":0},{"$f":"('Agg Blends'!J32/100)*('Agg Blends'!$K$16/100)*($M$31-$K$46)","v":0}]
[7.4999999999999997E-2,{"$f":"C46","v":0},0,0,0,0,0,0,0,0,{"$f":"('Agg Blends'!K34/100)*($M$31)","v":0},null,null,null,null,null,null,{"$error":"#DIV/0!"},{"$f":"('Agg Blends'!D33/100)*('Agg Blends'!$K$10/100)*($M$31-$K$46)","v":0},{"$f":"('Agg Blends'!E33/100)*('Agg Blends'!$K$11/100)*($M$31-$K$46)","v":0},{"$f":"('Agg Blends'!F33/100)*('Agg Blends'!$K$12/100)*($M$31-$K$46)","v":0},{"$f":"('Agg Blends'!G33/100)*('Agg Blends'!$K$13/100)*($M$31-$K$46)","v":0},{"$f":"('Agg Blends'!H33/100)*('Agg Blends'!$K$14/100)*($M$31-$K$46)","v":0},{"$f":"('Agg Blends'!I33/100)*('Agg Blends'!$K$15/100)*($M$31-$K$46)","v":0},{"$f":"('Agg Blends'!J33/100)*('Agg Blends'!$K$16/100)*($M$31-$K$46)","v":0}]

{"sheet":"Blend 2","index":19,"n_rows":46,"n_cols":25,"rows_kept":46,"cut":false,"hidden":false,"merged":[[5,2,5,3],[5,6,5,7],[5,8,5,9],[5,11,5,12],[5,13,5,14],[4,13,4,14],[29,4,29,5],[30,1,31,1],[30,2,31,2],[30,10,30,11],[9,4,9,5],[10,1,11,1],[10,2,11,2],[10,10,10,11],[4,0,4,1],[4,2,4,3],[4,6,4,7],[4,8,4,9],[4,11,4,12],[7,0,7,14],[5,0,5,1],[0,0,0,1],[2,0,2,14],[3,0,3,1],[3,2,3,3],[3,6,3,7],[3,8,3,9],[3,11,3,12],[3,13,3,14]]}
[{"$f":"Setup!A2","v":"ESB-19"}]
[]
["Blend Sheet 2"]
["Producer;",null,{"$f":"Setup!E7","v":0},null,null,null,"Material Class:",null,{"$f":"Setup!E10","v":0},null,null,"Nominal Size:",null,{"$f":"Setup!E9","v":0}]
["Designed By:",null,{"$f":"Setup!E8","v":0},null,null,null,"Esals:",null,{"$f":"Setup!E12","v":0},null,null,"SRL:",null,{"$f":"Setup!E11","v":0}]
["Date:",null,{"$f":"Setup!E6","v":"00:00:00"},null,null,null,"Rap:",null,{"$f":"Setup!E17","v":0},null,null,"PG Grade:",null,{"$f":"Setup!E14","v":0}]
[]
["Blend 2"]
[]
[null,null,null,null,"Gmb Specimen"]
[null,"Individual Weights","Cumulative Weights",null,null,null,null,null,null,null,"Total Aggregate Wt"]
["Sieve",null,null,{"$f":"'Agg Blends'!$I$10","v":0},{"$f":"'Agg Blends'!$I$11","v":0},{"$f":"'Agg Blends'!$I$12","v":0},{"$f":"'Agg Blends'!$I$13","v":0},{"$f":"'Agg Blends'!$I$14","v":0},{"$f":"'Agg Blends'!$I$15","v":0},{"$f":"'Agg Blends'!$I$16","v":0},null,null,null,null,null,null,null,null,1,2,3,4,5,6,7]
[50,{"$f":"C13-C14","v":0},{"$f":"IF(SUM(D13:J13)=0,0,SUM(D13:J13)+$K$26)","v":0},{"$f":"S13","v":0},0,0,0,0,0,0,"Binder %",null,null,null,null,null,null,{"$f":"(C13/$M$11)*100","v":{"$error":"#DIV/0!"}},{"$f":"('Agg Blends'!D20/100)*('Agg Blends'!$L$10/100)*($M$11-$K$26)","v":0},{"$f":"('Agg Blends'!E20/100)*('Agg Blends'!$L$11/100)*($M$11-$K$26)","v":0},{"$f":"('Agg Blends'!F20/100)*('Agg Blends'!$L$12/100)*($M$11-$K$26)","v":0},{"$f":"('Agg Blends'!G20/100)*('Agg Blends'!$L$13/100)*($M$11-$K$26)","v":0},{"$f":"('Agg Blends'!H20/100)*('Agg Blends'!$L$14/100)*($M$11-$K$26)","v":0},{"$f":"('Agg Blends'!I20/100)*('Agg Blends'!$L$15/100)*($M$11-$K$26)","v":0},{"$f":"('Agg Blends'!J20/100)*('Agg Blends'!$L$16/100)*($M$11-$K$26)","v":0}]
[37.5,0,0,0,0,0,0,0,0,0,"Agg Wt",{"$f":"M11","v":0},{"$f":"M11","v":0},{"$f":"M11","v":0},{"$f":"M11","v":0},null,null,{"$f":"(C14/$M$11)*100","v":{"$error":"#DIV/0!"}},{"$f":"('Agg Blends'!D21/100)*('Agg Blends'!$L$10/100)*($M$11-$K$26)","v":0},{"$f":"('Agg Blends'!E21/100)*('Agg Blends'!$L$11/100)*($M$11-$K$26)","v":0},{"$f":"('Agg Blends'!F21/100)*('Agg Blends'!$L$12/100)*($M$11-$K$26)","v":0},{"$f":"('Agg Blends'!G21/100)*('Agg Blends'!$L$13/100)*($M$11-$K$26)","v":0},{"$f":"('Agg Blends'!H21/100)*('Agg Blends'!$L$14/100)*($M$11-$K$26)","v":0},{"$f":"('Agg Blends'!I21/100)*('Agg Blends'!$L$15/100)*($M$11-$K$26)","v":0},{"$f":"('Agg Blends'!J21/100)*('Agg Blends'!$L$16/100)*($M$11-$K$26)","v":0}]
[25,0,0,0,0,0,0,0,0,0,"Binder Wt",{"$f":"L16-L14","v":0},{"$f":"M16-M14","v":0},{"$f":"N16-N14","v":0},{"$f":"O16-O14","v":0},null,null,{"$f":"(C15/$M$11)*100","v":{"$error":"#DIV/0!"}},{"$f":"('Agg Blends'!D22/100)*('Agg Blends'!$L$10/100)*($M$11-$K$26)","v":0},{"$f":"('Agg Blends'!E22/100)*('Agg Blends'!$L$11/100)*($M$11-$K$26)","v":0},{"$f":"('Agg Blends'!F22/100)*('Agg Blends'!$L$12/100)*($M$11-$K$26)","v":0},{"$f":"('Agg Blends'!G22/100)*('Agg Blends'!$L$13/100)*($M$11-$K$26)","v":0},{"$f":"('Agg Blends'!H22/100)*('Agg Blends'!$L$14/100)*($M$11-$K$26)","v":0},{"$f":"('Agg Blends'!I22/100)*('Agg Blends'!$L$15/100)*($M$11-$K$26)","v":0},{"$f":"('Agg Blends'!J22/100)*('Agg Blends'!$L$16/100)*($M$11-$K$26)","v":0}]
[19,0,0,0,0,0,0,0,0,0,"Total Wt",{"$f":"(L14/(100-L13))*100","v":0},{"$f":"(M14/(100-M13))*100","v":0},{"$f":"(N14/(100-N13))*100","v":0},{"$f":"(O14/(100-O13))*100","v":0},null,null,{"$error":"#DIV/0!"},{"$f":"('Agg Blends'!D23/100)*('Agg Blends'!$L$10/100)*($M$11-$K$26)","v":0},{"$f":"('Agg Blends'!E23/100)*('Agg Blends'!$L$11/100)*($M$11-$K$26)","v":0},{"$f":"('Agg Blends'!F23/100)*('Agg Blends'!$L$12/100)*($M$11-$K$26)","v":0},{"$f":"('Agg Blends'!G23/100)*('Agg Blends'!$L$13/100)*($M$11-$K$26)","v":0},{"$f":"('Agg Blends'!H23/100)*('Agg Blends'!$L$14/100)*($M$11-$K$26)","v":0},{"$f":"('Agg Blends'!I23/100)*('Agg Blends'!$L$15/100)*($M$11-$K$26)","v":0},{"$f":"('Agg Blends'!J23/100)*('Agg Blends'!$L$16/100)*($M$11-$K$26)","v":0}]
[12.5,0,0,0,0,0,0,0,0,0,null,null,null,null,null,null,null,{"$error":"#DIV/0!"},{"$f":"('Agg Blends'!D24/100)*('Agg Blends'!$L$10/100)*($M$11-$K$26)","v":0},{"$f":"('Agg Blends'!E24/100)*('Agg Blends'!$L$11/100)*($M$11-$K$26)","v":0},{"$f":"('Agg Blends'!F24/100)*('Agg Blends'!$L$12/100)*($M$11-$K$26)","v":0},{"$f":"('Agg Blends'!G24/100)*('Agg Blends'!$L$13/100)*($M$11-$K$26)","v":0},{"$f":"('Agg Blends'!H24/100)*('Agg Blends'!$L$14/100)*($M$11-$K$26)","v":0},{"$f":"('Agg Blends'!I24/100)*('Agg Blends'!$L$15/100)*($M$11-$K$26)","v":0},{"$f":"('Agg Blends'!J24/100)*('Agg Blends'!$L$16/100)*($M$11-$K$26)","v":0}]
[9.5,{"$f":"C18-C19","v":0},0,0,0,0,0,0,0,0,null,null,null,null,null,null,null,{"$error":"#DIV/0!"},{"$f":"('Agg Blends'!D25/100)*('Agg Blends'!$L$10/100)*($M$11-$K$26)","v":0},{"$f":"('Agg Blends'!E25/100)*('Agg Blends'!$L$11/100)*($M$11-$K$26)","v":0},{"$f":"('Agg Blends'!F25/100)*('Agg Blends'!$L$12/100)*($M$11-$K$26)","v":0},{"$f":"('Agg Blends'!G25/100)*('Agg Blends'!$L$13/100)*($M$11-$K$26)","v":0},{"$f":"('Agg Blends'!H25/100)*('Agg Blends'!$L$14/100)*($M$11-$K$26)","v":0},{"$f":"('Agg Blends'!I25/100)*('Agg Blends'!$L$15/100)*($M$11-$K$26)","v":0},{"$f":"('Agg Blends'!J25/100)*('Agg Blends'!$L$16/100)*($M$11-$K$26)","v":0}]
[6.33,0,0,{"$f":"S19","v":0},{"$f":"T19","v":0},{"$f":"U19","v":0},{"$f":"V19","v":0},{"$f":"W19","v":0},{"$f":"X19","v":0},{"$f":"Y19","v":0},null,null,null,null,null,null,null,{"$error":"#DIV/0!"},{"$f":"('Agg Blends'!D26/100)*('Agg Blends'!$L$10/100)*($M$11-$K$26)","v":0},{"$f":"('Agg Blends'!E26/100)*('Agg Blends'!$L$11/100)*($M$11-$K$26)","v":0},{"$f":"('Agg Blends'!F26/100)*('Agg Blends'!$L$12/100)*($M$11-$K$26)","v":0},{"$f":"('Agg Blends'!G26/100)*('Agg Blends'!$L$13/100)*($M$11-$K$26)","v":0},{"$f":"('Agg Blends'!H26/100)*('Agg Blends'!$L$14/100)*($M$11-$K$26)","v":0},{"$f":"('Agg Blends'!I26/100)*('Agg Blends'!$L$15/100)*($M$11-$K$26)","v":0},{"$f":"('Agg Blends'!J26/100)*('Agg Blends'!$L$16/100)*($M$11-$K$26)","v":0}]
[4.75,0,{"$f":"IF(SUM(D20:J20)=0,0,SUM(D20:J20)+$K$26)","v":0},0,0,0,0,0,0,0,null,null,null,null,null,null,null,{"$error":"#DIV/0!"},{"$f":"('Agg Blends'!D27/100)*('Agg Blends'!$L$10/100)*($M$11-$K$26)","v":0},{"$f":"('Agg Blends'!E27/100)*('Agg Blends'!$L$11/100)*($M$11-$K$26)","v":0},{"$f":"('Agg Blends'!F27/100)*('Agg Blends'!$L$12/100)*($M$11-$K$26)","v":0},{"$f":"('Agg Blends'!G27/100)*('Agg Blends'!$L$13/100)*($M$11-$K$26)","v":0},{"$f":"('Agg Blends'!H27/100)*('Agg Blends'!$L$14/100)*($M$11-$K$26)","v":0},{"$f":"('Agg Blends'!I27/100)*('Agg Blends'!$L$15/100)*($M$11-$K$26)","v":0},{"$f":"('Agg Blends'!J27/100)*('Agg Blends'!$L$16/100)*($M$11-$K$26)","v":0}]
[2.36,0,0,0,0,0,0,0,0,0,null,null,null,null,null,null,null,{"$error":"#DIV/0!"},{"$f":"('Agg Blends'!D28/100)*('Agg Blends'!$L$10/100)*($M$11-$K$26)","v":0},{"$f":"('Agg Blends'!E28/100)*('Agg Blends'!$L$11/100)*($M$11-$K$26)","v":0},{"$f":"('Agg Blends'!F28/100)*('Agg Blends'!$L$12/100)*($M$11-$K$26)","v":0},{"$f":"('Agg Blends'!G28/100)*('Agg Blends'!$L$13/100)*($M$11-$K$26)","v":0},{"$f":"('Agg Blends'!H28/100)*('Agg Blends'!$L$14/100)*($M$11-$K$26)","v":0},{"$f":"('Agg Blends'!I28/100)*('Agg Blends'!$L$15/100)*($M$11-$K$26)","v":0},{"$f":"('Agg Blends'!J28/100)*('Agg Blends'!$L$16/100)*($M$11-$K$26)","v":0}]
[1.18,0,0,0,0,0,0,0,0,0,null,null,null,null,null,null,null,{"$error":"#DIV/0!"},{"$f":"('Agg Blends'!D29/100)*('Agg Blends'!$L$10/100)*($M$11-$K$26)","v":0},{"$f":"('Agg Blends'!E29/100)*('Agg Blends'!$L$11/100)*($M$11-$K$26)","v":0},{"$f":"('Agg Blends'!F29/100)*('Agg Blends'!$L$12/100)*($M$11-$K$26)","v":0},{"$f":"('Agg Blends'!G29/100)*('Agg Blends'!$L$13/100)*($M$11-$K$26)","v":0},{"$f":"('Agg Blends'!H29/100)*('Agg Blends'!$L$14/100)*($M$11-$K$26)","v":0},{"$f":"('Agg Blends'!I29/100)*('Agg Blends'!$L$15/100)*($M$11-$K$26)","v":0},{"$f":"('Agg Blends'!J29/100)*('Agg Blends'!$L$16/100)*($M$11-$K$26)","v":0}]
[0.6,0,0,0,0,0,0,0,0,0,null,null,null,null,null,null,null,{"$error":"#DIV/0!"},{"$f":"('Agg Blends'!D30/100)*('Agg Blends'!$L$10/100)*($M$11-$K$26)","v":0},{"$f":"('Agg Blends'!E30/100)*('Agg Blends'!$L$11/100)*($M$11-$K$26)","v":0},{"$f":"('Agg Blends'!F30/100)*('Agg Blends'!$L$12/100)*($M$11-$K$26)","v":0},{"$f":"('Agg Blends'!G30/100)*('Agg Blends'!$L$13/100)*($M$11-$K$26)","v":0},{"$f":"('Agg Blends'!H30/100)*('Agg Blends'!$L$14/100)*($M$11-$K$26)","v":0},{"$f":"('Agg Blends'!I30/100)*('Agg Blends'!$L$15/100)*($M$11-$K$26)","v":0},{"$f":"('Agg Blends'!J30/100)*('Agg Blends'!$L$16/100)*($M$11-$K$26)","v":0}]
[0.3,0,0,0,0,0,0,0,0,0,null,null,null,null,null,null,null,{"$error":"#DIV/0!"},{"$f":"('Agg Blends'!D31/100)*('Agg Blends'!$L$10/100)*($M$11-$K$26)","v":0},{"$f":"('Agg Blends'!E31/100)*('Agg Blends'!$L$11/100)*($M$11-$K$26)","v":0},{"$f":"('Agg Blends'!F31/100)*('Agg Blends'!$L$12/100)*($M$11-$K$26)","v":0},{"$f":"('Agg Blends'!G31/100)*('Agg Blends'!$L$13/100)*($M$11-$K$26)","v":0},{"$f":"('Agg Blends'!H31/100)*('Agg Blends'!$L$14/100)*($M$11-$K$26)","v":0},{"$f":"('Agg Blends'!I31/100)*('Agg Blends'!$L$15/100)*($M$11-$K$26)","v":0},{"$f":"('Agg Blends'!J31/100)*('Agg Blends'!$L$16/100)*($M$11-$K$26)","v":0}]
[0.15,{"$f":"C25-C26","v":0},0,0,0,0,0,0,0,0,"Baghouse #200",null,null,null,null,null,null,{"$error":"#DIV/0!"},{"$f":"('Agg Blends'!D32/100)*('Agg Blends'!$L$10/100)*($M$11-$K$26)","v":0},{"$f":"('Agg Blends'!E32/100)*('Agg Blends'!$L$11/100)*($M$11-$K$26)","v":0},{"$f":"('Agg Blends'!F32/100)*('Agg Blends'!$L$12/100)*($M$11-$K$26)","v":0},{"$f":"('Agg Blends'!G32/100)*('Agg Blends'!$L$13/100)*($M$11-$K$26)","v":0},{"$f":"('Agg Blends'!H32/100)*('Agg Blends'!$L$14/100)*($M$11-$K$26)","v":0},{"$f":"('Agg Blends'!I32/100)*('Agg Blends'!$L$15/100)*($M$11-$K$26)","v":0},{"$f":"('Agg Blends'!J32/100)*('Agg Blends'!$L$16/100)*($M$11-$K$26)","v":0}]
[7.4999999999999997E-2,{"$f":"C26","v":0},0,0,0,0,0,0,0,0,{"$f":"('Agg Blends'!L34/100)*($M$11)","v":0},null,null,null,null,null,null,{"$error":"#DIV/0!"},{"$f":"('Agg Blends'!D33/100)*('Agg Blends'!$L$10/100)*($M$11-$K$26)","v":0},{"$f":"('Agg Blends'!E33/100)*('Agg Blends'!$L$11/100)*($M$11-$K$26)","v":0},{"$f":"('Agg Blends'!F33/100)*('Agg Blends'!$L$12/100)*($M$11-$K$26)","v":0},{"$f":"('Agg Blends'!G33/100)*('Agg Blends'!$L$13/100)*($M$11-$K$26)","v":0},{"$f":"('Agg Blends'!H33/100)*('Agg Blends'!$L$14/100)*($M$11-$K$26)","v":0},{"$f":"('Agg Blends'!I33/100)*('Agg Blends'!$L$15/100)*($M$11-$K$26)","v":0},{"$f":"('Agg Blends'!J33/100)*('Agg Blends'!$L$16/100)*($M$11-$K$26)","v":0}]
[]
[]
[]
[null,null,null,null,"Gmm Specimen"]
[null,"Individual Weights","Cumulative Weights",null,null,null,null,null,null,null,"Total Aggregate Wt"]
["Sieve",null,null,{"$f":"'Agg Blends'!$I$10","v":0},{"$f":"'Agg Blends'!$I$11","v":0},{"$f":"'Agg Blends'!$I$12","v":0},{"$f":"'Agg Blends'!$I$13","v":0},{"$f":"'Agg Blends'!$I$14","v":0},{"$f":"'Agg Blends'!$I$15","v":0},{"$f":"'Agg Blends'!$I$15","v":0},null,null,null,null,null,null,null,null,1,2,3,4,5,6,7]
[50,{"$f":"C33-C34","v":0},{"$f":"IF(SUM(D33:J33)=0,0,SUM(D33:J33)+$K$46)","v":0},{"$f":"S33","v":0},0,0,0,0,0,0,"Binder %",null,null,null,null,null,null,{"$f":"(C33/$M$31)*100","v":{"$error":"#DIV/0!"}},{"$f":"('Agg Blends'!D20/100)*('Agg Blends'!$L$10/100)*($M$31-$K$46)","v":0},{"$f":"('Agg Blends'!E20/100)*('Agg Blends'!$L$11/100)*($M$31-$K$46)","v":0},{"$f":"('Agg Blends'!F20/100)*('Agg Blends'!$L$12/100)*($M$31-$K$46)","v":0},{"$f":"('Agg Blends'!G20/100)*('Agg Blends'!$L$13/100)*($M$31-$K$46)","v":0},{"$f":"('Agg Blends'!H20/100)*('Agg Blends'!$L$14/100)*($M$31-$K$46)","v":0},{"$f":"('Agg Blends'!I20/100)*('Agg Blends'!$L$15/100)*($M$31-$K$46)","v":0},{"$f":"('Agg Blends'!J20/100)*('Agg Blends'!$L$16/100)*($M$31-$K$46)","v":0}]
[37.5,0,{"$f":"IF(SUM(D34:J34)=0,0,SUM(D34:J34)+$K$46)","v":0},0,0,0,0,0,0,0,"Agg Wt",{"$f":"M31","v":0},{"$f":"M31","v":0},{"$f":"M31","v":0},{"$f":"M31","v":0},null,null,{"$f":"(C34/$M$31)*100","v":{"$error":"#DIV/0!"}},{"$f":"('Agg Blends'!D21/100)*('Agg Blends'!$L$10/100)*($M$31-$K$46)","v":0},{"$f":"('Agg Blends'!E21/100)*('Agg Blends'!$L$11/100)*($M$31-$K$46)","v":0},{"$f":"('Agg Blends'!F21/100)*('Agg Blends'!$L$12/100)*($M$31-$K$46)","v":0},{"$f":"('Agg Blends'!G21/100)*('Agg Blends'!$L$13/100)*($M$31-$K$46)","v":0},{"$f":"('Agg Blends'!H21/100)*('Agg Blends'!$L$14/100)*($M$31-$K$46)","v":0},{"$f":"('Agg Blends'!I21/100)*('Agg Blends'!$L$15/100)*($M$31-$K$46)","v":0},{"$f":"('Agg Blends'!J21/100)*('Agg Blends'!$L$16/100)*($M$31-$K$46)","v":0}]
[25,0,0,0,0,0,0,0,0,0,"Binder Wt",{"$f":"L36-L34","v":0},{"$f":"M36-M34","v":0},{"$f":"N36-N34","v":0},{"$f":"O36-O34","v":0},null,null,{"$error":"#DIV/0!"},{"$f":"('Agg Blends'!D22/100)*('Agg Blends'!$L$10/100)*($M$31-$K$46)","v":0},{"$f":"('Agg Blends'!E22/100)*('Agg Blends'!$L$11/100)*($M$31-$K$46)","v":0},{"$f":"('Agg Blends'!F22/100)*('Agg Blends'!$L$12/100)*($M$31-$K$46)","v":0},{"$f":"('Agg Blends'!G22/100)*('Agg Blends'!$L$13/100)*($M$31-$K$46)","v":0},{"$f":"('Agg Blends'!H22/100)*('Agg Blends'!$L$14/100)*($M$31-$K$46)","v":0},{"$f":"('Agg Blends'!I22/100)*('Agg Blends'!$L$15/100)*($M$31-$K$46)","v":0},{"$f":"('Agg Blends'!J22/100)*('Agg Blends'!$L$16/100)*($M$31-$K$46)","v":0}]
[19,0,0,0,0,0,0,0,0,0,"Total Wt",{"$f":"(L34/(100-L33))*100","v":0},{"$f":"(M34/(100-M33))*100","v":0},{"$f":"(N34/(100-N33))*100","v":0},{"$f":"(O34/(100-O33))*100","v":0},null,null,{"$error":"#DIV/0!"},{"$f":"('Agg Blends'!D23/100)*('Agg Blends'!$L$10/100)*($M$31-$K$46)","v":0},{"$f":"('Agg Blends'!E23/100)*('Agg Blends'!$L$11/100)*($M$31-$K$46)","v":0},{"$f":"('Agg Blends'!F23/100)*('Agg Blends'!$L$12/100)*($M$31-$K$46)","v":0},{"$f":"('Agg Blends'!G23/100)*('Agg Blends'!$L$13/100)*($M$31-$K$46)","v":0},{"$f":"('Agg Blends'!H23/100)*('Agg Blends'!$L$14/100)*($M$31-$K$46)","v":0},{"$f":"('Agg Blends'!I23/100)*('Agg Blends'!$L$15/100)*($M$31-$K$46)","v":0},{"$f":"('Agg Blends'!J23/100)*('Agg Blends'!$L$16/100)*($M$31-$K$46)","v":0}]
[12.5,0,0,0,0,0,0,0,0,0,null,null,null,null,null,null,null,{"$error":"#DIV/0!"},{"$f":"('Agg Blends'!D24/100)*('Agg Blends'!$L$10/100)*($M$31-$K$46)","v":0},{"$f":"('Agg Blends'!E24/100)*('Agg Blends'!$L$11/100)*($M$31-$K$46)","v":0},{"$f":"('Agg Blends'!F24/100)*('Agg Blends'!$L$12/100)*($M$31-$K$46)","v":0},{"$f":"('Agg Blends'!G24/100)*('Agg Blends'!$L$13/100)*($M$31-$K$46)","v":0},{"$f":"('Agg Blends'!H24/100)*('Agg Blends'!$L$14/100)*($M$31-$K$46)","v":0},{"$f":"('Agg Blends'!I24/100)*('Agg Blends'!$L$15/100)*($M$31-$K$46)","v":0},{"$f":"('Agg Blends'!J24/100)*('Agg Blends'!$L$16/100)*($M$31-$K$46)","v":0}]
[9.5,{"$f":"C38-C39","v":0},0,0,0,0,0,0,0,0,null,null,null,null,null,null,null,{"$error":"#DIV/0!"},{"$f":"('Agg Blends'!D25/100)*('Agg Blends'!$L$10/100)*($M$31-$K$46)","v":0},{"$f":"('Agg Blends'!E25/100)*('Agg Blends'!$L$11/100)*($M$31-$K$46)","v":0},{"$f":"('Agg Blends'!F25/100)*('Agg Blends'!$L$12/100)*($M$31-$K$46)","v":0},{"$f":"('Agg Blends'!G25/100)*('Agg Blends'!$L$13/100)*($M$31-$K$46)","v":0},{"$f":"('Agg Blends'!H25/100)*('Agg Blends'!$L$14/100)*($M$31-$K$46)","v":0},{"$f":"('Agg Blends'!I25/100)*('Agg Blends'!$L$15/100)*($M$31-$K$46)","v":0},{"$f":"('Agg Blends'!J25/100)*('Agg Blends'!$L$16/100)*($M$31-$K$46)","v":0}]
[6.33,0,0,{"$f":"S39","v":0},{"$f":"T39","v":0},{"$f":"U39","v":0},{"$f":"V39","v":0},{"$f":"W39","v":0},{"$f":"X39","v":0},{"$f":"Y39","v":0},null,null,null,null,null,null,null,{"$error":"#DIV/0!"},{"$f":"('Agg Blends'!D26/100)*('Agg Blends'!$L$10/100)*($M$31-$K$46)","v":0},{"$f":"('Agg Blends'!E26/100)*('Agg Blends'!$L$11/100)*($M$31-$K$46)","v":0},{"$f":"('Agg Blends'!F26/100)*('Agg Blends'!$L$12/100)*($M$31-$K$46)","v":0},{"$f":"('Agg Blends'!G26/100)*('Agg Blends'!$L$13/100)*($M$31-$K$46)","v":0},{"$f":"('Agg Blends'!H26/100)*('Agg Blends'!$L$14/100)*($M$31-$K$46)","v":0},{"$f":"('Agg Blends'!I26/100)*('Agg Blends'!$L$15/100)*($M$31-$K$46)","v":0},{"$f":"('Agg Blends'!J26/100)*('Agg Blends'!$L$16/100)*($M$31-$K$46)","v":0}]
[4.75,0,0,0,0,0,0,0,0,0,null,null,null,null,null,null,null,{"$error":"#DIV/0!"},{"$f":"('Agg Blends'!D27/100)*('Agg Blends'!$L$10/100)*($M$31-$K$46)","v":0},{"$f":"('Agg Blends'!E27/100)*('Agg Blends'!$L$11/100)*($M$31-$K$46)","v":0},{"$f":"('Agg Blends'!F27/100)*('Agg Blends'!$L$12/100)*($M$31-$K$46)","v":0},{"$f":"('Agg Blends'!G27/100)*('Agg Blends'!$L$13/100)*($M$31-$K$46)","v":0},{"$f":"('Agg Blends'!H27/100)*('Agg Blends'!$L$14/100)*($M$31-$K$46)","v":0},{"$f":"('Agg Blends'!I27/100)*('Agg Blends'!$L$15/100)*($M$31-$K$46)","v":0},{"$f":"('Agg Blends'!J27/100)*('Agg Blends'!$L$16/100)*($M$31-$K$46)","v":0}]
[2.36,0,0,0,0,0,0,0,0,0,null,null,null,null,null,null,null,{"$error":"#DIV/0!"},{"$f":"('Agg Blends'!D28/100)*('Agg Blends'!$L$10/100)*($M$31-$K$46)","v":0},{"$f":"('Agg Blends'!E28/100)*('Agg Blends'!$L$11/100)*($M$31-$K$46)","v":0},{"$f":"('Agg Blends'!F28/100)*('Agg Blends'!$L$12/100)*($M$31-$K$46)","v":0},{"$f":"('Agg Blends'!G28/100)*('Agg Blends'!$L$13/100)*($M$31-$K$46)","v":0},{"$f":"('Agg Blends'!H28/100)*('Agg Blends'!$L$14/100)*($M$31-$K$46)","v":0},{"$f":"('Agg Blends'!I28/100)*('Agg Blends'!$L$15/100)*($M$31-$K$46)","v":0},{"$f":"('Agg Blends'!J28/100)*('Agg Blends'!$L$16/100)*($M$31-$K$46)","v":0}]
[1.18,0,0,0,0,0,0,0,0,0,null,null,null,null,null,null,null,{"$error":"#DIV/0!"},{"$f":"('Agg Blends'!D29/100)*('Agg Blends'!$L$10/100)*($M$31-$K$46)","v":0},{"$f":"('Agg Blends'!E29/100)*('Agg Blends'!$L$11/100)*($M$31-$K$46)","v":0},{"$f":"('Agg Blends'!F29/100)*('Agg Blends'!$L$12/100)*($M$31-$K$46)","v":0},{"$f":"('Agg Blends'!G29/100)*('Agg Blends'!$L$13/100)*($M$31-$K$46)","v":0},{"$f":"('Agg Blends'!H29/100)*('Agg Blends'!$L$14/100)*($M$31-$K$46)","v":0},{"$f":"('Agg Blends'!I29/100)*('Agg Blends'!$L$15/100)*($M$31-$K$46)","v":0},{"$f":"('Agg Blends'!J29/100)*('Agg Blends'!$L$16/100)*($M$31-$K$46)","v":0}]
[0.6,0,0,0,0,0,0,0,0,0,null,null,null,null,null,null,null,{"$error":"#DIV/0!"},{"$f":"('Agg Blends'!D30/100)*('Agg Blends'!$L$10/100)*($M$31-$K$46)","v":0},{"$f":"('Agg Blends'!E30/100)*('Agg Blends'!$L$11/100)*($M$31-$K$46)","v":0},{"$f":"('Agg Blends'!F30/100)*('Agg Blends'!$L$12/100)*($M$31-$K$46)","v":0},{"$f":"('Agg Blends'!G30/100)*('Agg Blends'!$L$13/100)*($M$31-$K$46)","v":0},{"$f":"('Agg Blends'!H30/100)*('Agg Blends'!$L$14/100)*($M$31-$K$46)","v":0},{"$f":"('Agg Blends'!I30/100)*('Agg Blends'!$L$15/100)*($M$31-$K$46)","v":0},{"$f":"('Agg Blends'!J30/100)*('Agg Blends'!$L$16/100)*($M$31-$K$46)","v":0}]
[0.3,0,0,0,0,0,0,0,0,0,null,null,null,null,null,null,null,{"$error":"#DIV/0!"},{"$f":"('Agg Blends'!D31/100)*('Agg Blends'!$L$10/100)*($M$31-$K$46)","v":0},{"$f":"('Agg Blends'!E31/100)*('Agg Blends'!$L$11/100)*($M$31-$K$46)","v":0},{"$f":"('Agg Blends'!F31/100)*('Agg Blends'!$L$12/100)*($M$31-$K$46)","v":0},{"$f":"('Agg Blends'!G31/100)*('Agg Blends'!$L$13/100)*($M$31-$K$46)","v":0},{"$f":"('Agg Blends'!H31/100)*('Agg Blends'!$L$14/100)*($M$31-$K$46)","v":0},{"$f":"('Agg Blends'!I31/100)*('Agg Blends'!$L$15/100)*($M$31-$K$46)","v":0},{"$f":"('Agg Blends'!J31/100)*('Agg Blends'!$L$16/100)*($M$31-$K$46)","v":0}]
[0.15,{"$f":"C45-C46","v":0},0,0,0,0,0,0,0,0,"Baghouse #200",null,null,null,null,null,null,{"$error":"#DIV/0!"},{"$f":"('Agg Blends'!D32/100)*('Agg Blends'!$L$10/100)*($M$31-$K$46)","v":0},{"$f":"('Agg Blends'!E32/100)*('Agg Blends'!$L$11/100)*($M$31-$K$46)","v":0},{"$f":"('Agg Blends'!F32/100)*('Agg Blends'!$L$12/100)*($M$31-$K$46)","v":0},{"$f":"('Agg Blends'!G32/100)*('Agg Blends'!$L$13/100)*($M$31-$K$46)","v":0},{"$f":"('Agg Blends'!H32/100)*('Agg Blends'!$L$14/100)*($M$31-$K$46)","v":0},{"$f":"('Agg Blends'!I32/100)*('Agg Blends'!$L$15/100)*($M$31-$K$46)","v":0},{"$f":"('Agg Blends'!J32/100)*('Agg Blends'!$L$16/100)*($M$31-$K$46)","v":0}]
[7.4999999999999997E-2,{"$f":"C46","v":0},0,0,0,0,0,0,0,0,{"$f":"('Agg Blends'!L34/100)*($M$31)","v":0},null,null,null,null,null,null,{"$error":"#DIV/0!"},{"$f":"('Agg Blends'!D33/100)*('Agg Blends'!$L$10/100)*($M$31-$K$46)","v":0},{"$f":"('Agg Blends'!E33/100)*('Agg Blends'!$L$11/100)*($M$31-$K$46)","v":0},{"$f":"('Agg Blends'!F33/100)*('Agg Blends'!$L$12/100)*($M$31-$K$46)","v":0},{"$f":"('Agg Blends'!G33/100)*('Agg Blends'!$L$13/100)*($M$31-$K$46)","v":0},{"$f":"('Agg Blends'!H33/100)*('Agg Blends'!$L$14/100)*($M$31-$K$46)","v":0},{"$f":"('Agg Blends'!I33/100)*('Agg Blends'!$L$15/100)*($M$31-$K$46)","v":0},{"$f":"('Agg Blends'!J33/100)*('Agg Blends'!$L$16/100)*($M$31-$K$46)","v":0}]

{"sheet":"Blend 3","index":20,"n_rows":46,"n_cols":25,"rows_kept":46,"cut":false,"hidden":false,"merged":[[5,2,5,3],[5,6,5,7],[5,8,5,9],[5,11,5,12],[5,13,5,14],[4,13,4,14],[29,4,29,5],[30,1,31,1],[30,2,31,2],[30,10,30,11],[9,4,9,5],[10,1,11,1],[10,2,11,2],[10,10,10,11],[4,0,4,1],[4,2,4,3],[4,6,4,7],[4,8,4,9],[4,11,4,12],[7,0,7,14],[5,0,5,1],[0,0,0,1],[2,0,2,14],[3,0,3,1],[3,2,3,3],[3,6,3,7],[3,8,3,9],[3,11,3,12],[3,13,3,14]]}
[{"$f":"Setup!A2","v":"ESB-19"}]
[]
["Blend Sheet 3"]
["Producer;",null,{"$f":"Setup!E7","v":0},null,null,null,"Material Class:",null,{"$f":"Setup!E10","v":0},null,null,"Nominal Size:",null,{"$f":"Setup!E9","v":0}]
["Designed By:",null,{"$f":"Setup!E8","v":0},null,null,null,"Esals:",null,{"$f":"Setup!E12","v":0},null,null,"SRL:",null,{"$f":"Setup!E11","v":0}]
["Date:",null,{"$f":"Setup!E6","v":"00:00:00"},null,null,null,"Rap:",null,{"$f":"Setup!E17","v":0},null,null,"PG Grade:",null,{"$f":"Setup!E14","v":0}]
[]
["Blend 3"]
[]
[null,null,null,null,"Gmb Specimen"]
[null,"Individual Weights","Cumulative Weights",null,null,null,null,null,null,null,"Total Aggregate Wt"]
["Sieve",null,null,{"$f":"'Agg Blends'!$I$10","v":0},{"$f":"'Agg Blends'!$I$11","v":0},{"$f":"'Agg Blends'!$I$12","v":0},{"$f":"'Agg Blends'!$I$13","v":0},{"$f":"'Agg Blends'!$I$14","v":0},{"$f":"'Agg Blends'!$I$15","v":0},{"$f":"'Agg Blends'!$I$16","v":0},null,null,null,null,null,null,null,null,1,2,3,4,5,6,7]
[50,{"$f":"C13-C14","v":0},{"$f":"IF(SUM(D13:J13)=0,0,SUM(D13:J13)+$K$26)","v":0},{"$f":"S13","v":0},0,0,0,0,0,0,"Binder %",null,null,null,null,null,null,{"$f":"(C13/$M$11)*100","v":{"$error":"#DIV/0!"}},{"$f":"('Agg Blends'!D20/100)*('Agg Blends'!$M$10/100)*($M$11-$K$26)","v":0},{"$f":"('Agg Blends'!E20/100)*('Agg Blends'!$M$11/100)*($M$11-$K$26)","v":0},{"$f":"('Agg Blends'!F20/100)*('Agg Blends'!$M$12/100)*($M$11-$K$26)","v":0},{"$f":"('Agg Blends'!G20/100)*('Agg Blends'!$M$13/100)*($M$11-$K$26)","v":0},{"$f":"('Agg Blends'!H20/100)*('Agg Blends'!$M$14/100)*($M$11-$K$26)","v":0},{"$f":"('Agg Blends'!I20/100)*('Agg Blends'!$M$15/100)*($M$11-$K$26)","v":0},{"$f":"('Agg Blends'!J20/100)*('Agg Blends'!$M$16/100)*($M$11-$K$26)","v":0}]
[37.5,0,0,0,0,0,0,0,0,0,"Agg Wt",{"$f":"M11","v":0},{"$f":"M11","v":0},{"$f":"M11","v":0},{"$f":"M11","v":0},null,null,{"$f":"(C14/$M$11)*100","v":{"$error":"#DIV/0!"}},{"$f":"('Agg Blends'!D21/100)*('Agg Blends'!$M$10/100)*($M$11-$K$26)","v":0},{"$f":"('Agg Blends'!E21/100)*('Agg Blends'!$M$11/100)*($M$11-$K$26)","v":0},{"$f":"('Agg Blends'!F21/100)*('Agg Blends'!$M$12/100)*($M$11-$K$26)","v":0},{"$f":"('Agg Blends'!G21/100)*('Agg Blends'!$M$13/100)*($M$11-$K$26)","v":0},{"$f":"('Agg Blends'!H21/100)*('Agg Blends'!$M$14/100)*($M$11-$K$26)","v":0},{"$f":"('Agg Blends'!I21/100)*('Agg Blends'!$M$15/100)*($M$11-$K$26)","v":0},{"$f":"('Agg Blends'!J21/100)*('Agg Blends'!$M$16/100)*($M$11-$K$26)","v":0}]
[25,0,0,0,0,0,0,0,0,0,"Binder Wt",{"$f":"L16-L14","v":0},{"$f":"M16-M14","v":0},{"$f":"N16-N14","v":0},{"$f":"O16-O14","v":0},null,null,{"$f":"(C15/$M$11)*100","v":{"$error":"#DIV/0!"}},{"$f":"('Agg Blends'!D22/100)*('Agg Blends'!$M$10/100)*($M$11-$K$26)","v":0},{"$f":"('Agg Blends'!E22/100)*('Agg Blends'!$M$11/100)*($M$11-$K$26)","v":0},{"$f":"('Agg Blends'!F22/100)*('Agg Blends'!$M$12/100)*($M$11-$K$26)","v":0},{"$f":"('Agg Blends'!G22/100)*('Agg Blends'!$M$13/100)*($M$11-$K$26)","v":0},{"$f":"('Agg Blends'!H22/100)*('Agg Blends'!$M$14/100)*($M$11-$K$26)","v":0},{"$f":"('Agg Blends'!I22/100)*('Agg Blends'!$M$15/100)*($M$11-$K$26)","v":0},{"$f":"('Agg Blends'!J22/100)*('Agg Blends'!$M$16/100)*($M$11-$K$26)","v":0}]
[19,0,0,0,0,0,0,0,0,0,"Total Wt",{"$f":"(L14/(100-L13))*100","v":0},{"$f":"(M14/(100-M13))*100","v":0},{"$f":"(N14/(100-N13))*100","v":0},{"$f":"(O14/(100-O13))*100","v":0},null,null,{"$error":"#DIV/0!"},{"$f":"('Agg Blends'!D23/100)*('Agg Blends'!$M$10/100)*($M$11-$K$26)","v":0},{"$f":"('Agg Blends'!E23/100)*('Agg Blends'!$M$11/100)*($M$11-$K$26)","v":0},{"$f":"('Agg Blends'!F23/100)*('Agg Blends'!$M$12/100)*($M$11-$K$26)","v":0},{"$f":"('Agg Blends'!G23/100)*('Agg Blends'!$M$13/100)*($M$11-$K$26)","v":0},{"$f":"('Agg Blends'!H23/100)*('Agg Blends'!$M$14/100)*($M$11-$K$26)","v":0},{"$f":"('Agg Blends'!I23/100)*('Agg Blends'!$M$15/100)*($M$11-$K$26)","v":0},{"$f":"('Agg Blends'!J23/100)*('Agg Blends'!$M$16/100)*($M$11-$K$26)","v":0}]
[12.5,0,0,0,0,0,0,0,0,0,null,null,null,null,null,null,null,{"$error":"#DIV/0!"},{"$f":"('Agg Blends'!D24/100)*('Agg Blends'!$M$10/100)*($M$11-$K$26)","v":0},{"$f":"('Agg Blends'!E24/100)*('Agg Blends'!$M$11/100)*($M$11-$K$26)","v":0},{"$f":"('Agg Blends'!F24/100)*('Agg Blends'!$M$12/100)*($M$11-$K$26)","v":0},{"$f":"('Agg Blends'!G24/100)*('Agg Blends'!$M$13/100)*($M$11-$K$26)","v":0},{"$f":"('Agg Blends'!H24/100)*('Agg Blends'!$M$14/100)*($M$11-$K$26)","v":0},{"$f":"('Agg Blends'!I24/100)*('Agg Blends'!$M$15/100)*($M$11-$K$26)","v":0},{"$f":"('Agg Blends'!J24/100)*('Agg Blends'!$M$16/100)*($M$11-$K$26)","v":0}]
[9.5,{"$f":"C18-C19","v":0},0,0,0,0,0,0,0,0,null,null,null,null,null,null,null,{"$error":"#DIV/0!"},{"$f":"('Agg Blends'!D25/100)*('Agg Blends'!$M$10/100)*($M$11-$K$26)","v":0},{"$f":"('Agg Blends'!E25/100)*('Agg Blends'!$M$11/100)*($M$11-$K$26)","v":0},{"$f":"('Agg Blends'!F25/100)*('Agg Blends'!$M$12/100)*($M$11-$K$26)","v":0},{"$f":"('Agg Blends'!G25/100)*('Agg Blends'!$M$13/100)*($M$11-$K$26)","v":0},{"$f":"('Agg Blends'!H25/100)*('Agg Blends'!$M$14/100)*($M$11-$K$26)","v":0},{"$f":"('Agg Blends'!I25/100)*('Agg Blends'!$M$15/100)*($M$11-$K$26)","v":0},{"$f":"('Agg Blends'!J25/100)*('Agg Blends'!$M$16/100)*($M$11-$K$26)","v":0}]
[6.33,0,0,{"$f":"S19","v":0},{"$f":"T19","v":0},{"$f":"U19","v":0},{"$f":"V19","v":0},{"$f":"W19","v":0},{"$f":"X19","v":0},{"$f":"Y19","v":0},null,null,null,null,null,null,null,{"$error":"#DIV/0!"},{"$f":"('Agg Blends'!D26/100)*('Agg Blends'!$M$10/100)*($M$11-$K$26)","v":0},{"$f":"('Agg Blends'!E26/100)*('Agg Blends'!$M$11/100)*($M$11-$K$26)","v":0},{"$f":"('Agg Blends'!F26/100)*('Agg Blends'!$M$12/100)*($M$11-$K$26)","v":0},{"$f":"('Agg Blends'!G26/100)*('Agg Blends'!$M$13/100)*($M$11-$K$26)","v":0},{"$f":"('Agg Blends'!H26/100)*('Agg Blends'!$M$14/100)*($M$11-$K$26)","v":0},{"$f":"('Agg Blends'!I26/100)*('Agg Blends'!$M$15/100)*($M$11-$K$26)","v":0},{"$f":"('Agg Blends'!J26/100)*('Agg Blends'!$M$16/100)*($M$11-$K$26)","v":0}]
[4.75,0,0,0,0,0,0,0,0,0,null,null,null,null,null,null,null,{"$error":"#DIV/0!"},{"$f":"('Agg Blends'!D27/100)*('Agg Blends'!$M$10/100)*($M$11-$K$26)","v":0},{"$f":"('Agg Blends'!E27/100)*('Agg Blends'!$M$11/100)*($M$11-$K$26)","v":0},{"$f":"('Agg Blends'!F27/100)*('Agg Blends'!$M$12/100)*($M$11-$K$26)","v":0},{"$f":"('Agg Blends'!G27/100)*('Agg Blends'!$M$13/100)*($M$11-$K$26)","v":0},{"$f":"('Agg Blends'!H27/100)*('Agg Blends'!$M$14/100)*($M$11-$K$26)","v":0},{"$f":"('Agg Blends'!I27/100)*('Agg Blends'!$M$15/100)*($M$11-$K$26)","v":0},{"$f":"('Agg Blends'!J27/100)*('Agg Blends'!$M$16/100)*($M$11-$K$26)","v":0}]
[2.36,0,0,0,0,0,0,0,0,0,null,null,null,null,null,null,null,{"$error":"#DIV/0!"},{"$f":"('Agg Blends'!D28/100)*('Agg Blends'!$M$10/100)*($M$11-$K$26)","v":0},{"$f":"('Agg Blends'!E28/100)*('Agg Blends'!$M$11/100)*($M$11-$K$26)","v":0},{"$f":"('Agg Blends'!F28/100)*('Agg Blends'!$M$12/100)*($M$11-$K$26)","v":0},{"$f":"('Agg Blends'!G28/100)*('Agg Blends'!$M$13/100)*($M$11-$K$26)","v":0},{"$f":"('Agg Blends'!H28/100)*('Agg Blends'!$M$14/100)*($M$11-$K$26)","v":0},{"$f":"('Agg Blends'!I28/100)*('Agg Blends'!$M$15/100)*($M$11-$K$26)","v":0},{"$f":"('Agg Blends'!J28/100)*('Agg Blends'!$M$16/100)*($M$11-$K$26)","v":0}]
[1.18,0,0,0,0,0,0,0,0,0,null,null,null,null,null,null,null,{"$error":"#DIV/0!"},{"$f":"('Agg Blends'!D29/100)*('Agg Blends'!$M$10/100)*($M$11-$K$26)","v":0},{"$f":"('Agg Blends'!E29/100)*('Agg Blends'!$M$11/100)*($M$11-$K$26)","v":0},{"$f":"('Agg Blends'!F29/100)*('Agg Blends'!$M$12/100)*($M$11-$K$26)","v":0},{"$f":"('Agg Blends'!G29/100)*('Agg Blends'!$M$13/100)*($M$11-$K$26)","v":0},{"$f":"('Agg Blends'!H29/100)*('Agg Blends'!$M$14/100)*($M$11-$K$26)","v":0},{"$f":"('Agg Blends'!I29/100)*('Agg Blends'!$M$15/100)*($M$11-$K$26)","v":0},{"$f":"('Agg Blends'!J29/100)*('Agg Blends'!$M$16/100)*($M$11-$K$26)","v":0}]
[0.6,0,0,0,0,0,0,0,0,0,null,null,null,null,null,null,null,{"$error":"#DIV/0!"},{"$f":"('Agg Blends'!D30/100)*('Agg Blends'!$M$10/100)*($M$11-$K$26)","v":0},{"$f":"('Agg Blends'!E30/100)*('Agg Blends'!$M$11/100)*($M$11-$K$26)","v":0},{"$f":"('Agg Blends'!F30/100)*('Agg Blends'!$M$12/100)*($M$11-$K$26)","v":0},{"$f":"('Agg Blends'!G30/100)*('Agg Blends'!$M$13/100)*($M$11-$K$26)","v":0},{"$f":"('Agg Blends'!H30/100)*('Agg Blends'!$M$14/100)*($M$11-$K$26)","v":0},{"$f":"('Agg Blends'!I30/100)*('Agg Blends'!$M$15/100)*($M$11-$K$26)","v":0},{"$f":"('Agg Blends'!J30/100)*('Agg Blends'!$M$16/100)*($M$11-$K$26)","v":0}]
[0.3,0,0,0,0,0,0,0,0,0,null,null,null,null,null,null,null,{"$error":"#DIV/0!"},{"$f":"('Agg Blends'!D31/100)*('Agg Blends'!$M$10/100)*($M$11-$K$26)","v":0},{"$f":"('Agg Blends'!E31/100)*('Agg Blends'!$M$11/100)*($M$11-$K$26)","v":0},{"$f":"('Agg Blends'!F31/100)*('Agg Blends'!$M$12/100)*($M$11-$K$26)","v":0},{"$f":"('Agg Blends'!G31/100)*('Agg Blends'!$M$13/100)*($M$11-$K$26)","v":0},{"$f":"('Agg Blends'!H31/100)*('Agg Blends'!$M$14/100)*($M$11-$K$26)","v":0},{"$f":"('Agg Blends'!I31/100)*('Agg Blends'!$M$15/100)*($M$11-$K$26)","v":0},{"$f":"('Agg Blends'!J31/100)*('Agg Blends'!$M$16/100)*($M$11-$K$26)","v":0}]
[0.15,{"$f":"C25-C26","v":0},0,0,0,0,0,0,0,0,"Baghouse #200",null,null,null,null,null,null,{"$error":"#DIV/0!"},{"$f":"('Agg Blends'!D32/100)*('Agg Blends'!$M$10/100)*($M$11-$K$26)","v":0},{"$f":"('Agg Blends'!E32/100)*('Agg Blends'!$M$11/100)*($M$11-$K$26)","v":0},{"$f":"('Agg Blends'!F32/100)*('Agg Blends'!$M$12/100)*($M$11-$K$26)","v":0},{"$f":"('Agg Blends'!G32/100)*('Agg Blends'!$M$13/100)*($M$11-$K$26)","v":0},{"$f":"('Agg Blends'!H32/100)*('Agg Blends'!$M$14/100)*($M$11-$K$26)","v":0},{"$f":"('Agg Blends'!I32/100)*('Agg Blends'!$M$15/100)*($M$11-$K$26)","v":0},{"$f":"('Agg Blends'!J32/100)*('Agg Blends'!$M$16/100)*($M$11-$K$26)","v":0}]
[7.4999999999999997E-2,{"$f":"C26","v":0},0,0,0,0,0,0,0,0,{"$f":"('Agg Blends'!M34/100)*($M$11)","v":0},null,null,null,null,null,null,{"$error":"#DIV/0!"},{"$f":"('Agg Blends'!D33/100)*('Agg Blends'!$M$10/100)*($M$11-$K$26)","v":0},{"$f":"('Agg Blends'!E33/100)*('Agg Blends'!$M$11/100)*($M$11-$K$26)","v":0},{"$f":"('Agg Blends'!F33/100)*('Agg Blends'!$M$12/100)*($M$11-$K$26)","v":0},{"$f":"('Agg Blends'!G33/100)*('Agg Blends'!$M$13/100)*($M$11-$K$26)","v":0},{"$f":"('Agg Blends'!H33/100)*('Agg Blends'!$M$14/100)*($M$11-$K$26)","v":0},{"$f":"('Agg Blends'!I33/100)*('Agg Blends'!$M$15/100)*($M$11-$K$26)","v":0},{"$f":"('Agg Blends'!J33/100)*('Agg Blends'!$M$16/100)*($M$11-$K$26)","v":0}]
[]
[]
[]
[null,null,null,null,"Gmm Specimen"]
[null,"Individual Weights","Cumulative Weights",null,null,null,null,null,null,null,"Total Aggregate Wt"]
["Sieve",null,null,{"$f":"'Agg Blends'!$I$10","v":0},{"$f":"'Agg Blends'!$I$11","v":0},{"$f":"'Agg Blends'!$I$12","v":0},{"$f":"'Agg Blends'!$I$13","v":0},{"$f":"'Agg Blends'!$I$14","v":0},{"$f":"'Agg Blends'!$I$15","v":0},{"$f":"'Agg Blends'!$I$15","v":0},null,null,null,null,null,null,null,null,1,2,3,4,5,6,7]
[50,{"$f":"C33-C34","v":0},{"$f":"IF(SUM(D33:J33)=0,0,SUM(D33:J33)+$K$46)","v":0},{"$f":"S33","v":0},0,0,0,0,0,0,"Binder %",null,null,null,null,null,null,{"$f":"(C33/$M$31)*100","v":{"$error":"#DIV/0!"}},{"$f":"('Agg Blends'!D20/100)*('Agg Blends'!$M$10/100)*($M$31-$K$46)","v":0},{"$f":"('Agg Blends'!E20/100)*('Agg Blends'!$M$11/100)*($M$31-$K$46)","v":0},{"$f":"('Agg Blends'!F20/100)*('Agg Blends'!$M$12/100)*($M$31-$K$46)","v":0},{"$f":"('Agg Blends'!G20/100)*('Agg Blends'!$M$13/100)*($M$31-$K$46)","v":0},{"$f":"('Agg Blends'!H20/100)*('Agg Blends'!$M$14/100)*($M$31-$K$46)","v":0},{"$f":"('Agg Blends'!I20/100)*('Agg Blends'!$M$15/100)*($M$31-$K$46)","v":0},{"$f":"('Agg Blends'!J20/100)*('Agg Blends'!$M$16/100)*($M$31-$K$46)","v":0}]
[37.5,0,{"$f":"IF(SUM(D34:J34)=0,0,SUM(D34:J34)+$K$46)","v":0},0,0,0,0,0,0,0,"Agg Wt",{"$f":"M31","v":0},{"$f":"M31","v":0},{"$f":"M31","v":0},{"$f":"M31","v":0},null,null,{"$f":"(C34/$M$31)*100","v":{"$error":"#DIV/0!"}},{"$f":"('Agg Blends'!D21/100)*('Agg Blends'!$M$10/100)*($M$31-$K$46)","v":0},{"$f":"('Agg Blends'!E21/100)*('Agg Blends'!$M$11/100)*($M$31-$K$46)","v":0},{"$f":"('Agg Blends'!F21/100)*('Agg Blends'!$M$12/100)*($M$31-$K$46)","v":0},{"$f":"('Agg Blends'!G21/100)*('Agg Blends'!$M$13/100)*($M$31-$K$46)","v":0},{"$f":"('Agg Blends'!H21/100)*('Agg Blends'!$M$14/100)*($M$31-$K$46)","v":0},{"$f":"('Agg Blends'!I21/100)*('Agg Blends'!$M$15/100)*($M$31-$K$46)","v":0},{"$f":"('Agg Blends'!J21/100)*('Agg Blends'!$M$16/100)*($M$31-$K$46)","v":0}]
[25,0,0,0,0,0,0,0,0,0,"Binder Wt",{"$f":"L36-L34","v":0},{"$f":"M36-M34","v":0},{"$f":"N36-N34","v":0},{"$f":"O36-O34","v":0},null,null,{"$error":"#DIV/0!"},{"$f":"('Agg Blends'!D22/100)*('Agg Blends'!$M$10/100)*($M$31-$K$46)","v":0},{"$f":"('Agg Blends'!E22/100)*('Agg Blends'!$M$11/100)*($M$31-$K$46)","v":0},{"$f":"('Agg Blends'!F22/100)*('Agg Blends'!$M$12/100)*($M$31-$K$46)","v":0},{"$f":"('Agg Blends'!G22/100)*('Agg Blends'!$M$13/100)*($M$31-$K$46)","v":0},{"$f":"('Agg Blends'!H22/100)*('Agg Blends'!$M$14/100)*($M$31-$K$46)","v":0},{"$f":"('Agg Blends'!I22/100)*('Agg Blends'!$M$15/100)*($M$31-$K$46)","v":0},{"$f":"('Agg Blends'!J22/100)*('Agg Blends'!$M$16/100)*($M$31-$K$46)","v":0}]
[19,0,0,0,0,0,0,0,0,0,"Total Wt",{"$f":"(L34/(100-L33))*100","v":0},{"$f":"(M34/(100-M33))*100","v":0},{"$f":"(N34/(100-N33))*100","v":0},{"$f":"(O34/(100-O33))*100","v":0},null,null,{"$error":"#DIV/0!"},{"$f":"('Agg Blends'!D23/100)*('Agg Blends'!$M$10/100)*($M$31-$K$46)","v":0},{"$f":"('Agg Blends'!E23/100)*('Agg Blends'!$M$11/100)*($M$31-$K$46)","v":0},{"$f":"('Agg Blends'!F23/100)*('Agg Blends'!$M$12/100)*($M$31-$K$46)","v":0},{"$f":"('Agg Blends'!G23/100)*('Agg Blends'!$M$13/100)*($M$31-$K$46)","v":0},{"$f":"('Agg Blends'!H23/100)*('Agg Blends'!$M$14/100)*($M$31-$K$46)","v":0},{"$f":"('Agg Blends'!I23/100)*('Agg Blends'!$M$15/100)*($M$31-$K$46)","v":0},{"$f":"('Agg Blends'!J23/100)*('Agg Blends'!$M$16/100)*($M$31-$K$46)","v":0}]
[12.5,0,0,0,0,0,0,0,0,0,null,null,null,null,null,null,null,{"$error":"#DIV/0!"},{"$f":"('Agg Blends'!D24/100)*('Agg Blends'!$M$10/100)*($M$31-$K$46)","v":0},{"$f":"('Agg Blends'!E24/100)*('Agg Blends'!$M$11/100)*($M$31-$K$46)","v":0},{"$f":"('Agg Blends'!F24/100)*('Agg Blends'!$M$12/100)*($M$31-$K$46)","v":0},{"$f":"('Agg Blends'!G24/100)*('Agg Blends'!$M$13/100)*($M$31-$K$46)","v":0},{"$f":"('Agg Blends'!H24/100)*('Agg Blends'!$M$14/100)*($M$31-$K$46)","v":0},{"$f":"('Agg Blends'!I24/100)*('Agg Blends'!$M$15/100)*($M$31-$K$46)","v":0},{"$f":"('Agg Blends'!J24/100)*('Agg Blends'!$M$16/100)*($M$31-$K$46)","v":0}]
[9.5,{"$f":"C38-C39","v":0},0,0,0,0,0,0,0,0,null,null,null,null,null,null,null,{"$error":"#DIV/0!"},{"$f":"('Agg Blends'!D25/100)*('Agg Blends'!$M$10/100)*($M$31-$K$46)","v":0},{"$f":"('Agg Blends'!E25/100)*('Agg Blends'!$M$11/100)*($M$31-$K$46)","v":0},{"$f":"('Agg Blends'!F25/100)*('Agg Blends'!$M$12/100)*($M$31-$K$46)","v":0},{"$f":"('Agg Blends'!G25/100)*('Agg Blends'!$M$13/100)*($M$31-$K$46)","v":0},{"$f":"('Agg Blends'!H25/100)*('Agg Blends'!$M$14/100)*($M$31-$K$46)","v":0},{"$f":"('Agg Blends'!I25/100)*('Agg Blends'!$M$15/100)*($M$31-$K$46)","v":0},{"$f":"('Agg Blends'!J25/100)*('Agg Blends'!$M$16/100)*($M$31-$K$46)","v":0}]
[6.33,0,0,{"$f":"S39","v":0},{"$f":"T39","v":0},{"$f":"U39","v":0},{"$f":"V39","v":0},{"$f":"W39","v":0},{"$f":"X39","v":0},{"$f":"Y39","v":0},null,null,null,null,null,null,null,{"$error":"#DIV/0!"},{"$f":"('Agg Blends'!D26/100)*('Agg Blends'!$M$10/100)*($M$31-$K$46)","v":0},{"$f":"('Agg Blends'!E26/100)*('Agg Blends'!$M$11/100)*($M$31-$K$46)","v":0},{"$f":"('Agg Blends'!F26/100)*('Agg Blends'!$M$12/100)*($M$31-$K$46)","v":0},{"$f":"('Agg Blends'!G26/100)*('Agg Blends'!$M$13/100)*($M$31-$K$46)","v":0},{"$f":"('Agg Blends'!H26/100)*('Agg Blends'!$M$14/100)*($M$31-$K$46)","v":0},{"$f":"('Agg Blends'!I26/100)*('Agg Blends'!$M$15/100)*($M$31-$K$46)","v":0},{"$f":"('Agg Blends'!J26/100)*('Agg Blends'!$M$16/100)*($M$31-$K$46)","v":0}]
[4.75,0,0,0,0,0,0,0,0,0,null,null,null,null,null,null,null,{"$error":"#DIV/0!"},{"$f":"('Agg Blends'!D27/100)*('Agg Blends'!$M$10/100)*($M$31-$K$46)","v":0},{"$f":"('Agg Blends'!E27/100)*('Agg Blends'!$M$11/100)*($M$31-$K$46)","v":0},{"$f":"('Agg Blends'!F27/100)*('Agg Blends'!$M$12/100)*($M$31-$K$46)","v":0},{"$f":"('Agg Blends'!G27/100)*('Agg Blends'!$M$13/100)*($M$31-$K$46)","v":0},{"$f":"('Agg Blends'!H27/100)*('Agg Blends'!$M$14/100)*($M$31-$K$46)","v":0},{"$f":"('Agg Blends'!I27/100)*('Agg Blends'!$M$15/100)*($M$31-$K$46)","v":0},{"$f":"('Agg Blends'!J27/100)*('Agg Blends'!$M$16/100)*($M$31-$K$46)","v":0}]
[2.36,0,0,0,0,0,0,0,0,0,null,null,null,null,null,null,null,{"$error":"#DIV/0!"},{"$f":"('Agg Blends'!D28/100)*('Agg Blends'!$M$10/100)*($M$31-$K$46)","v":0},{"$f":"('Agg Blends'!E28/100)*('Agg Blends'!$M$11/100)*($M$31-$K$46)","v":0},{"$f":"('Agg Blends'!F28/100)*('Agg Blends'!$M$12/100)*($M$31-$K$46)","v":0},{"$f":"('Agg Blends'!G28/100)*('Agg Blends'!$M$13/100)*($M$31-$K$46)","v":0},{"$f":"('Agg Blends'!H28/100)*('Agg Blends'!$M$14/100)*($M$31-$K$46)","v":0},{"$f":"('Agg Blends'!I28/100)*('Agg Blends'!$M$15/100)*($M$31-$K$46)","v":0},{"$f":"('Agg Blends'!J28/100)*('Agg Blends'!$M$16/100)*($M$31-$K$46)","v":0}]
[1.18,0,0,0,0,0,0,0,0,0,null,null,null,null,null,null,null,{"$error":"#DIV/0!"},{"$f":"('Agg Blends'!D29/100)*('Agg Blends'!$M$10/100)*($M$31-$K$46)","v":0},{"$f":"('Agg Blends'!E29/100)*('Agg Blends'!$M$11/100)*($M$31-$K$46)","v":0},{"$f":"('Agg Blends'!F29/100)*('Agg Blends'!$M$12/100)*($M$31-$K$46)","v":0},{"$f":"('Agg Blends'!G29/100)*('Agg Blends'!$M$13/100)*($M$31-$K$46)","v":0},{"$f":"('Agg Blends'!H29/100)*('Agg Blends'!$M$14/100)*($M$31-$K$46)","v":0},{"$f":"('Agg Blends'!I29/100)*('Agg Blends'!$M$15/100)*($M$31-$K$46)","v":0},{"$f":"('Agg Blends'!J29/100)*('Agg Blends'!$M$16/100)*($M$31-$K$46)","v":0}]
[0.6,0,0,0,0,0,0,0,0,0,null,null,null,null,null,null,null,{"$error":"#DIV/0!"},{"$f":"('Agg Blends'!D30/100)*('Agg Blends'!$M$10/100)*($M$31-$K$46)","v":0},{"$f":"('Agg Blends'!E30/100)*('Agg Blends'!$M$11/100)*($M$31-$K$46)","v":0},{"$f":"('Agg Blends'!F30/100)*('Agg Blends'!$M$12/100)*($M$31-$K$46)","v":0},{"$f":"('Agg Blends'!G30/100)*('Agg Blends'!$M$13/100)*($M$31-$K$46)","v":0},{"$f":"('Agg Blends'!H30/100)*('Agg Blends'!$M$14/100)*($M$31-$K$46)","v":0},{"$f":"('Agg Blends'!I30/100)*('Agg Blends'!$M$15/100)*($M$31-$K$46)","v":0},{"$f":"('Agg Blends'!J30/100)*('Agg Blends'!$M$16/100)*($M$31-$K$46)","v":0}]
[0.3,0,0,0,0,0,0,0,0,0,null,null,null,null,null,null,null,{"$error":"#DIV/0!"},{"$f":"('Agg Blends'!D31/100)*('Agg Blends'!$M$10/100)*($M$31-$K$46)","v":0},{"$f":"('Agg Blends'!E31/100)*('Agg Blends'!$M$11/100)*($M$31-$K$46)","v":0},{"$f":"('Agg Blends'!F31/100)*('Agg Blends'!$M$12/100)*($M$31-$K$46)","v":0},{"$f":"('Agg Blends'!G31/100)*('Agg Blends'!$M$13/100)*($M$31-$K$46)","v":0},{"$f":"('Agg Blends'!H31/100)*('Agg Blends'!$M$14/100)*($M$31-$K$46)","v":0},{"$f":"('Agg Blends'!I31/100)*('Agg Blends'!$M$15/100)*($M$31-$K$46)","v":0},{"$f":"('Agg Blends'!J31/100)*('Agg Blends'!$M$16/100)*($M$31-$K$46)","v":0}]
[0.15,{"$f":"C45-C46","v":0},0,0,0,0,0,0,0,0,"Baghouse #200",null,null,null,null,null,null,{"$error":"#DIV/0!"},{"$f":"('Agg Blends'!D32/100)*('Agg Blends'!$M$10/100)*($M$31-$K$46)","v":0},{"$f":"('Agg Blends'!E32/100)*('Agg Blends'!$M$11/100)*($M$31-$K$46)","v":0},{"$f":"('Agg Blends'!F32/100)*('Agg Blends'!$M$12/100)*($M$31-$K$46)","v":0},{"$f":"('Agg Blends'!G32/100)*('Agg Blends'!$M$13/100)*($M$31-$K$46)","v":0},{"$f":"('Agg Blends'!H32/100)*('Agg Blends'!$M$14/100)*($M$31-$K$46)","v":0},{"$f":"('Agg Blends'!I32/100)*('Agg Blends'!$M$15/100)*($M$31-$K$46)","v":0},{"$f":"('Agg Blends'!J32/100)*('Agg Blends'!$M$16/100)*($M$31-$K$46)","v":0}]
[7.4999999999999997E-2,{"$f":"C46","v":0},0,0,0,0,0,0,0,0,{"$f":"('Agg Blends'!M34/100)*($M$31)","v":0},null,null,null,null,null,null,{"$error":"#DIV/0!"},{"$f":"('Agg Blends'!D33/100)*('Agg Blends'!$M$10/100)*($M$31-$K$46)","v":0},{"$f":"('Agg Blends'!E33/100)*('Agg Blends'!$M$11/100)*($M$31-$K$46)","v":0},{"$f":"('Agg Blends'!F33/100)*('Agg Blends'!$M$12/100)*($M$31-$K$46)","v":0},{"$f":"('Agg Blends'!G33/100)*('Agg Blends'!$M$13/100)*($M$31-$K$46)","v":0},{"$f":"('Agg Blends'!H33/100)*('Agg Blends'!$M$14/100)*($M$31-$K$46)","v":0},{"$f":"('Agg Blends'!I33/100)*('Agg Blends'!$M$15/100)*($M$31-$K$46)","v":0},{"$f":"('Agg Blends'!J33/100)*('Agg Blends'!$M$16/100)*($M$31-$K$46)","v":0}]